program: Orca
programVersion: 5.0.3
elementType: Cl N N N N N C C C C C C C H H H H H H H H H H H H
charge: 0
multiplicity: 1
keywords: wb97x-d3
keywords: def2-TZVPP
keywords: def2/J RIJCOSX
keywords: DEFGRID2
keywords: scfconv7
keywords: smallprint printgap noloewdin
keywords: NOSOSCF
formula: C7H12ClN5
InChI: InChI=1/C7H12ClN5/c1-3-9-6-11-5(8)12-7(13-6)10-4-2/h9-10H,3-4H2,1-2H3
25 atoms
Cl 3.565974 0.01358 -0.199248
N  -0.686317 2.280336 0.398956
N  -0.671292 -2.301682 0.319972
N  -0.753069 -0.010765 0.340194
N  1.295101 -1.17756 0.074027
N  1.286822 1.178476 0.113873
C  -2.118959 2.414566 0.51851
C  -2.103014 -2.44751 0.43832
C  -0.044866 1.11159 0.280548
C  -0.037138 -1.125512 0.242296
C  -2.852756 2.316981 -0.811229
C  -2.842694 -2.290191 -0.882413
C  1.855076 0.003703 0.020862
H  -2.4840 1.648821 1.202272
H  -2.315506 3.378973 0.988577
H  -2.293515 -3.433823 0.863124
H  -2.469112 -1.716653 1.158995
H  -0.115239 3.100416 0.288937
H  -0.095253 -3.114328 0.184353
H  -2.687408 1.343291 -1.270588
H  -3.925888 2.442703 -0.66455
H  -2.517551 3.085221 -1.508302
H  -3.914567 -2.428138 -0.737434
H  -2.683644 -1.294684 -1.294685
H  -2.506468 -3.022611 -1.616488
totalener: -1008.04286389 hartree
nucrepener: 908.84562030 hartree
electener: -1916.88848419 hartree
oneelecener: -3182.69715029 hartree
twoeener: 1265.80866610 hartree
kineticenergy: 1005.08802961 hartree
xcener: -74.178645412803 hartree
chargesum: -0.0000000
charge: -0.043259 -0.208999 -0.209105 -0.446884 -0.352234 -0.352197 0.004847 0.004529 0.397223 0.397443 -0.240726 -0.239913 0.177304 0.079624 0.085223 0.085191 0.079383 0.148639 0.148673 0.086401 0.079698 0.076723 0.079545 0.086515 0.076357
qa: -0.0433 -0.2090 -0.2091 -0.4469 -0.3522 -0.3522 0.0048 0.0045 0.3972 0.3974 -0.2407 -0.2399 0.1773 0.0796 0.0852 0.0852 0.0794 0.1486 0.1487 0.0864 0.0797 0.0767 0.0795 0.0865 0.0764
va: 1.2589 3.1859 3.1856 2.9587 2.9923 2.9921 3.8809 3.8812 4.2012 4.2013 3.9051 3.9033 4.4794 1.0169 0.9981 0.9982 1.0167 1.0372 1.0372 1.0061 1.0106 1.0115 1.0107 1.0064 1.0118
dispcorr: -0.009225432 hartree
energy: -1008.052089322899
dipole: -31.40400 29.62488 -1.77913 -0.02050 0.01353 -0.00697 -2.26177 2.37033 0.10856
magnitude: 1.78245 au
magnitude: 4.53063 debye
