program: Orca
programVersion: 5.0.3
elementType: Cl N N N N N C C C C C C C H H H H H H H H H H H H
charge: 0
multiplicity: 1
keywords: wb97x-d3
keywords: def2-TZVPP
keywords: def2/J RIJCOSX
keywords: DEFGRID2
keywords: scfconv7
keywords: smallprint printgap noloewdin
keywords: NOSOSCF
formula: C7H12ClN5
InChI: InChI=1/C7H12ClN5/c1-3-9-6-11-5(8)12-7(13-6)10-4-2/h9-10H,3-4H2,1-2H3
25 atoms
Cl 3.061384 0.620672 -0.464291
N  -1.586802 1.705023 0.502743
N  -0.5544 -2.616807 -0.574941
N  -1.128959 -0.466823 -0.016542
N  1.114057 -1.068592 -0.500191
N  0.589744 1.16736 0.026199
C  -1.294356 3.113126 0.652982
C  -1.893768 -3.127375 -0.402405
C  -0.685495 0.777786 0.157088
C  -0.19595 -1.346263 -0.351595
C  -1.241287 3.866695 -0.66756
C  -2.228649 -3.477482 1.039961
C  1.400835 0.187487 -0.292274
H  -2.064719 3.533991 1.30056
H  -0.346024 3.216776 1.178589
H  -2.597136 -2.384854 -0.777769
H  -1.992305 -4.007408 -1.039415
H  -2.541609 1.392249 0.530956
H  0.201166 -3.251144 -0.768196
H  -2.177306 3.77119 -1.218817
H  -1.062742 4.928164 -0.492285
H  -0.43317 3.488965 -1.29235
H  -3.242822 -3.872356 1.110686
H  -1.54809 -4.23206 1.435023
H  -2.16558 -2.594548 1.674481
totalener: -1008.04304168 hartree
nucrepener: 902.15919285 hartree
electener: -1910.20223454 hartree
oneelecener: -3169.42643656 hartree
twoeener: 1259.22420202 hartree
kineticenergy: 1005.08677718 hartree
xcener: -74.177991135297 hartree
chargesum: -0.0000000
charge: -0.043655 -0.211856 -0.208007 -0.432369 -0.349722 -0.375218 0.003340 0.003162 0.405091 0.407035 -0.240211 -0.240425 0.170405 0.081956 0.087474 0.079291 0.084655 0.143443 0.147643 0.068188 0.079420 0.097898 0.078475 0.072934 0.091052
qa: -0.0437 -0.2119 -0.2080 -0.4324 -0.3497 -0.3752 0.0033 0.0032 0.4051 0.4070 -0.2402 -0.2404 0.1704 0.0820 0.0875 0.0793 0.0847 0.1434 0.1476 0.0682 0.0794 0.0979 0.0785 0.0729 0.0911
va: 1.2605 3.1875 3.1886 2.9771 2.9936 2.9453 3.8755 3.8781 4.1786 4.1827 3.9027 3.9056 4.4781 0.9966 1.0189 1.0217 0.9977 1.0384 1.0376 1.0095 1.0109 1.0117 1.0106 1.0099 1.0112
dispcorr: -0.008590060 hartree
energy: -1008.051631743944
dipole: -22.49505 20.93847 -1.55658 -1.04743 0.73679 -0.31063 3.19809 -3.03047 0.16763
magnitude: 1.59610 au
magnitude: 4.05696 debye
