program: Orca
programVersion: 5.0.3
elementType: Cl N N N N N C C C C C C C C C H H H H H H H H H H H H H H H H
charge: 0
multiplicity: 1
keywords: wb97x-d3
keywords: def2-TZVPP
keywords: def2/J RIJCOSX
keywords: DEFGRID2
keywords: scfconv7
keywords: smallprint printgap noloewdin
keywords: NOSOSCF
formula: C9H16ClN5
InChI: InChI=1/C9H16ClN5/c1-5(2)11-8-13-7(10)14-9(15-8)12-6(3)4/h5-6,11-12H,1-4H3
31 atoms
Cl 3.840482 0.000229 0.092961
N  -0.431392 -2.296357 -0.090368
N  -0.430536 2.296508 -0.114289
N  -0.507359 0.000498 -0.036165
N  1.551315 1.180385 -0.006821
N  1.550822 -1.179893 0.004774
C  -1.871115 -2.497722 -0.065497
C  -1.870256 2.497854 -0.087402
C  -2.321782 -2.974934 1.308138
C  -2.273993 -3.475025 -1.158396
C  -2.2702 3.491322 -1.166645
C  -2.323272 2.955965 1.292024
C  0.198851 -1.125247 -0.03515
C  0.199341 1.125808 -0.04628
C  2.107852 0.000248 0.022278
H  -2.331776 -1.53385 -0.272611
H  -2.331472 1.537428 -0.309242
H  0.14933 -3.121204 -0.04644
H  0.150255 3.121549 -0.075303
H  -2.046252 -2.260941 2.085115
H  -3.405025 -3.098286 1.334339
H  -1.869417 -3.93762 1.555128
H  -1.99892 -3.103771 -2.145777
H  -3.353038 -3.629248 -1.147615
H  -1.799269 -4.44822 -1.014863
H  -1.794619 4.461788 -1.008163
H  -1.9941 3.134369 -2.158985
H  -3.349039 3.646669 -1.155098
H  -2.047504 2.232348 2.059989
H  -3.40676 3.077212 1.318674
H  -1.872517 3.915945 1.552041
elementType: Cl N C H
totalener: -1086.69893179 hartree
nucrepener: 1123.41552666 hartree
electener: -2210.11445845 hartree
oneelecener: -3715.74913735 hartree
twoeener: 1505.63467890 hartree
cpcmener: -0.02289996 hartree
kineticenergy: 1083.26704968 hartree
xcener: -82.525237408313 hartree
chargesum: 0.0000000
charge: -0.070266 -0.181696 -0.181915 -0.458768 -0.410694 -0.410676 0.112039 0.112912 -0.272360 -0.261485 -0.261165 -0.272866 0.397058 0.397263 0.193421 0.074622 0.074001 0.165282 0.165346 0.092337 0.090548 0.089318 0.093336 0.087692 0.091661 0.091794 0.093473 0.087647 0.092193 0.090764 0.089186
qa: -0.0703 -0.1817 -0.1819 -0.4588 -0.4107 -0.4107 0.1120 0.1129 -0.2724 -0.2615 -0.2612 -0.2729 0.3971 0.3973 0.1934 0.0746 0.0740 0.1653 0.1653 0.0923 0.0905 0.0893 0.0933 0.0877 0.0917 0.0918 0.0935 0.0876 0.0922 0.0908 0.0892
va: 1.2334 3.2141 3.2136 2.9674 2.9565 2.9562 3.8431 3.8435 3.9441 3.9313 3.9301 3.9439 4.2279 4.2264 4.4752 1.0246 1.0240 1.0248 1.0248 1.0069 1.0058 1.0046 1.0082 1.0054 1.0032 1.0032 1.0082 1.0053 1.0069 1.0058 1.0046
dispcorr: -0.011690106 hartree
energy: -1086.710621899000
dipole: -36.48510 33.86081 -2.62429 -0.00562 0.00526 -0.00036 0.33660 -0.36430 -0.02770
magnitude: 2.62444 au
magnitude: 6.67079 debye
