program: Orca
programVersion: 5.0.3
elementType: Cl N N N N N C C C C C C C C C H H H H H H H H H H H H H H H H
charge: 0
multiplicity: 1
keywords: wb97x-d3
keywords: def2-TZVPP
keywords: def2/J RIJCOSX
keywords: DEFGRID2
keywords: scfconv7
keywords: smallprint printgap noloewdin
keywords: NOSOSCF
formula: C9H16ClN5
InChI: InChI=1/C9H16ClN5/c1-5(2)11-8-13-7(10)14-9(15-8)12-6(3)4/h5-6,11-12H,1-4H3
31 atoms
Cl 3.849679 -0.000722 0.000281
N  -0.428725 -2.295015 0.143901
N  -0.427951 2.295669 0.133105
N  -0.504053 0.000203 0.086411
N  1.555387 1.178297 0.065718
N  1.555003 -1.178655 0.071285
C  -1.870152 -2.484322 0.145605
C  -1.869301 2.485549 0.134238
C  -2.200481 -3.725048 0.960092
C  -2.419213 -2.575402 -1.272258
C  -2.418455 2.571604 -1.283899
C  -2.199143 3.729359 0.944191
C  0.204382 -1.124998 0.098356
C  0.204744 1.12522 0.093053
C  2.11476 -0.000313 0.05048
H  -2.310815 -1.616242 0.637276
H  -2.310223 1.619447 0.629152
H  0.154894 -3.117665 0.102487
H  0.155997 3.117892 0.088015
H  -1.742754 -4.618668 0.529148
H  -1.854672 -3.629281 1.990045
H  -3.278147 -3.886787 0.983138
H  -1.991419 -3.426786 -1.805464
H  -2.199274 -1.67162 -1.842071
H  -3.502959 -2.700337 -1.255858
H  -1.990171 3.420671 -1.820393
H  -2.199189 1.66553 -1.850328
H  -3.502116 2.697307 -1.267855
H  -1.853297 3.637244 1.974462
H  -3.276754 3.891548 0.966714
H  -1.741155 4.621249 0.509953
elementType: Cl N C H
totalener: -1086.70951330 hartree
nucrepener: 1127.21721680 hartree
electener: -2213.92673010 hartree
oneelecener: -3723.33642582 hartree
twoeener: 1509.40969572 hartree
cpcmener: -0.02007017 hartree
kineticenergy: 1083.25185295 hartree
xcener: -82.522269352544 hartree
chargesum: -0.0000000
charge: -0.068368 -0.186055 -0.186097 -0.462607 -0.404497 -0.404513 0.121631 0.121413 -0.258077 -0.274548 -0.274484 -0.257958 0.399919 0.399917 0.192608 0.061773 0.061837 0.165057 0.165069 0.089771 0.098780 0.086615 0.088014 0.089941 0.090897 0.088046 0.089937 0.090887 0.098710 0.086626 0.089757
qa: -0.0684 -0.1861 -0.1861 -0.4626 -0.4045 -0.4045 0.1216 0.1214 -0.2581 -0.2745 -0.2745 -0.2580 0.3999 0.3999 0.1926 0.0618 0.0618 0.1651 0.1651 0.0898 0.0988 0.0866 0.0880 0.0899 0.0909 0.0880 0.0899 0.0909 0.0987 0.0866 0.0898
va: 1.2347 3.2052 3.2052 2.9567 2.9650 2.9651 3.8465 3.8467 3.9188 3.9311 3.9313 3.9189 4.2188 4.2188 4.4752 1.0226 1.0226 1.0264 1.0264 1.0029 1.0076 1.0059 1.0071 1.0091 1.0061 1.0071 1.0091 1.0061 1.0076 1.0059 1.0029
dispcorr: -0.011986490 hartree
energy: -1086.721499789501
dipole: -36.63520 34.10484 -2.53036 0.00397 -0.00342 0.00055 -1.57997 1.63824 0.05826
magnitude: 2.53103 au
magnitude: 6.43336 debye
