program: Orca
programVersion: 4.2.1
elementType: Cl Cl O N C C C C C C C C C H H H H H H H H H
charge: 0
multiplicity: 1
keywords: wb97x-d3
keywords: def2-TZVPP
keywords: def2/J RIJCOSX GRIDX6 NOFINALGRIDX
keywords: grid4 nofinalgrid
keywords: scfconv7
keywords: smallprint printgap noloewdin
keywords: NOSOSCF
formula: C9H9Cl2NO
InChI: InChI=1/C9H9Cl2NO/c1-2-9(13)12-6-3-4-7(10)8(11)5-6/h3-5,12H,2H2,1H3
22 atoms
Cl 2.237334 -1.894931 -0.036815
Cl 3.776531 0.850605 0.066295
O  -2.741184 -1.395814 -0.07537
N  -2.131202 0.795525 0.003494
C  -0.738296 0.736946 0.015697
C  -4.481914 0.258383 -0.033782
C  -3.042923 -0.227676 -0.038842
C  -0.012257 -0.450804 -0.014391
C  -0.046864 1.948872 0.060886
C  -5.490198 -0.874334 -0.090358
C  1.37418 -0.409889 0.001263
C  1.332064 1.97619 0.076052
C  2.059883 0.7969 0.046535
H  -4.644106 0.86509 0.863285
H  -4.627193 0.93637 -0.881313
H  -2.513865 1.726408 0.030939
H  -0.509963 -1.405538 -0.050003
H  -0.588859 2.886981 0.08471
H  -5.385715 -1.543717 0.761215
H  -5.369432 -1.46996 -0.993039
H  -6.503505 -0.47487 -0.082942
H  1.852779 2.922766 0.111251
totalener: -1398.84055145 hartree
nucrepener: 934.55509289 hartree
electener: -2333.39564433 hartree
oneelecener: -3776.44124519 hartree
twoeener: 1443.04560085 hartree
kineticenergy: 1395.45841427 hartree
xcener: -88.731640830950 hartree
chargesum: 0.0000000
charge: -0.047432 -0.057740 -0.387801 -0.171200 0.191864 -0.157105 0.349063 -0.187227 -0.217097 -0.240868 0.089220 -0.086368 -0.012130 0.086210 0.085629 0.128424 0.152520 0.098779 0.089983 0.089641 0.085005 0.118630
qa: -0.0474 -0.0577 -0.3878 -0.1712 0.1919 -0.1571 0.3491 -0.1872 -0.2171 -0.2409 0.0892 -0.0864 -0.0121 0.0862 0.0856 0.1284 0.1525 0.0988 0.0900 0.0896 0.0850 0.1186
va: 1.2724 1.2611 2.1137 3.2501 3.9324 3.8640 4.0872 4.0304 4.0310 3.9766 3.9811 4.0473 4.0007 1.0039 1.0039 1.0333 1.0528 1.0157 1.0085 1.0085 1.0044 1.0146
dispcorr: -0.007894901 hartree
energy: -1398.848446345922
dipole: -34.72676 33.31274 -1.41402 5.51815 -3.83801 1.68015 -0.18714 0.22936 0.04223
magnitude: 2.19639 au
magnitude: 5.58277 debye
