program: Gaussian 09
title: 000064025
version: EM64L-G09RevD.01
frameworkgroup: C1[X(C18H18ClN3O2)]
method: RPBEPBE
basis: SDD
operation: Freq
keyword: #p
keyword: freq=noraman
keyword: PBEPBE/SDD
title: #p freq=noraman PBEPBE/SDD
converged: YES YES NO NO
title: Mulliken charges:
elementType: Cl O O N N N C C C C C C C C C C C C C C C C C C H H H H H H H H H H H H H H H H H H
charge: -0.064834 -0.242403 -0.225941 -0.229101 -0.259813 -0.077958 -0.461670 0.364443 0.059150 0.129470 0.205874 0.499023 -0.468175 -0.320420 -0.334970 -0.220221 -0.245968 -0.337874 -0.347727 -0.640107 -0.614408 -0.091514 -0.202063 -0.261298 0.266712 0.271184 0.197390 0.252655 0.288498 0.275050 0.234396 0.237080 0.258410 0.286406 0.277559 0.176713 0.223566 0.187006 0.226896 0.231246 0.237007 0.260732
chargesum: 0.00000
title: Mulliken charges with hydrogens summed into heavy atoms:
elementType: Cl O O N N N C C C C C C C C C C C C C C C C C C
charge: -0.064834 -0.242403 -0.225941 -0.229101 -0.259813 -0.077958 0.076226 0.364443 0.059150 0.129470 0.205874 0.499023 -0.018130 -0.031922 -0.059919 0.014176 -0.008888 -0.079464 -0.061321 0.037731 0.030740 -0.091514 0.034944 -0.000566
polarizability: 3.25656372e+02 2.95609891e+01 2.48374862e+02 8.67627832e+00 -1.97471428e+01 1.51983806e+02
1716.lowfreq: -7.3248 -3.4506 -0.0017 -0.0007 0.0013 4.2534 19.0073 22.1951 34.2897
frequency: 18.7686 22.0607 34.2882 48.2980 62.7676 73.2158 105.0093 116.8521 132.9489 147.8328 176.9233 192.5230 196.3375 226.1854 230.4919 247.9992 259.5756 279.1109 292.6635 326.7484 338.4601 357.5382 365.5808 377.7000 410.7916 414.4622 432.5728 440.1505 445.5164 488.0199 516.6886 556.1611 569.8490 576.9928 593.6686 640.0022 657.2238 677.4509 680.9789 704.4619 734.2058 765.8279 777.6636 783.3196 785.2966 828.6242 853.8669 859.5223 880.1273 888.4873 896.7155 968.9888 974.9382 975.1445 980.0408 997.8142 1009.2447 1031.6602 1037.6979 1051.0733 1065.6836 1077.2124 1091.8461 1092.2608 1105.1772 1122.4548 1131.4593 1147.4434 1163.7522 1175.9838 1183.8769 1194.4410 1228.3650 1237.2843 1276.6998 1290.4048 1293.4647 1302.4200 1326.1124 1330.5114 1365.2760 1374.6022 1387.9322 1398.4244 1417.8294 1428.1706 1431.1497 1447.3862 1452.5571 1462.9332 1466.5809 1469.9614 1474.2439 1484.3081 1488.9046 1492.9772 1568.2730 1573.7221 1592.8276 1604.7901 1609.2872 1626.5493 2769.6290 2846.7158 2861.3188 2976.2303 3000.2186 3021.6064 3044.3553 3081.5340 3113.8761 3139.3595 3149.9339 3150.1360 3154.8097 3163.2075 3171.6344 3179.1085 3203.8736 3209.2623
redmass: 6.4743 4.8942 5.0141 4.7428 4.0603 4.9499 5.0965 3.2175 5.9364 5.0414 5.9250 4.0796 4.3058 1.2270 1.7142 1.9135 4.3813 3.8162 6.3731 3.4050 4.3818 2.8138 3.2536 7.1725 6.2578 4.3434 3.9084 3.0899 2.8434 5.6710 3.6873 5.2914 3.4883 6.1529 7.2983 5.7178 6.9418 3.0809 3.1060 5.7058 5.5918 2.3907 2.6606 1.7707 2.0971 5.1720 1.6593 4.1043 2.1797 2.0451 1.4465 1.3825 1.9646 1.4550 4.8147 1.3410 2.6888 2.5986 1.5640 2.6792 2.2271 2.0062 1.8673 1.3967 2.2834 3.0520 1.3784 2.6251 2.2055 1.1094 1.0910 2.2359 2.3129 2.4893 2.8777 1.4612 1.4714 1.5237 2.5579 1.6060 1.9636 4.8853 5.1144 1.7297 1.1459 2.6344 1.1972 2.3845 1.1426 1.0555 1.7287 1.2547 2.5690 1.0573 1.0538 1.1651 7.1511 7.2649 8.2220 6.8527 7.9924 8.5052 1.0697 1.0574 1.0573 1.0725 1.0841 1.0727 1.0739 1.1009 1.0991 1.0869 1.0892 1.0911 1.0914 1.0917 1.0988 1.0958 1.0955 1.0946
irintensity: 0.3981 0.0829 1.5318 3.9449 0.4901 0.9453 3.1643 1.6903 0.5822 0.9964 0.1552 4.6888 2.2971 0.5937 1.6767 1.1720 1.1487 2.1117 3.8388 11.1196 13.3800 2.9040 2.9670 7.2007 1.5549 1.4605 2.5376 5.3035 0.8365 5.7970 5.2321 1.7909 1.6517 6.8203 10.5086 3.2515 8.1597 8.9931 37.3191 22.9863 12.7640 40.5383 19.5956 27.6284 51.8790 19.8219 20.3399 25.5377 2.3022 3.6215 0.2556 4.2632 2.2230 0.9140 8.2256 0.4133 152.2252 47.0983 19.9340 57.8890 28.6734 19.2064 2.1773 8.9450 16.2685 33.2357 20.2656 22.4161 111.1818 13.0307 1.6240 122.8687 35.4934 154.9776 7.3457 17.9280 11.8453 5.7052 256.8534 74.4650 151.5342 5.8139 10.9584 61.3505 8.7950 21.9329 18.8486 58.0323 30.8779 17.7656 85.6467 4.9487 145.9255 8.8180 33.8836 3.1625 42.6275 69.4055 96.7173 89.8757 258.7642 69.0652 118.4206 65.9421 210.2448 32.0078 19.3050 37.7930 39.6037 37.4439 10.7120 4.3559 10.2738 5.2819 8.9961 3.5842 22.0429 3.1244 0.3220 1.6911
temp: 298.150 k
press: 1.00000 atm
elementType: 17 8 8 7 7 7 6 6 6 6 6 6 6 6 6 6 6 6 6 6 6 6 6 6 1 1 1 1 1 1 1 1 1 1 1 1 1 1 1 1 1 1
symmnumber: 1
zpe: 856570.9 jmol-1
zpe.correction: 0.326251 hartree
zpe.thermalcorrener: 0.348139 hartree
zpe.thermalcorrenthalpy: 0.349083 hartree
zpe.thermalcorrgfe: 0.273338 hartree
zpe.sumelectzpe: -1469.749172 hartree
zpe.sumelectthermal: -1469.727284 hartree
zpe.sumelectthermalent: -1469.726339 hartree
zpe.sumelectthermalfe: -1469.802085 hartree
dipole: 0.1255 1.7231 -1.9903
dipole: 2.6356
quadrupole: -146.3312 -148.7333 -147.1479
quadrupole: 8.5720 14.8437 -4.7382
quadrupole: 1.0729 -1.3292 0.2563 8.5720 14.8437 -4.7382
hfenergy: -1470.0754229 hartree
pointgroup: C01 [X(C18H18Cl1N3O2)]
dipole: 0.3034704 0.5769742 0.8063476 debye
polarizability: 285.6103701|-48.5978085|287.3130202|8.7330324|23.2835455|153.0916494 unknown
InChI: InChI=1S/C18H18ClN3O2/c1-20(2)11-17(23)22-12-21(14-7-5-6-13(19)10-14)18(24)15-8-3-4-9-16(15)22/h3-10H,11-12H2,1-2H3
charge 0 multiplicity 1
42 atoms
Cl -4.33502 2.936604 1.886175
O  -1.563064 -2.769279 -0.562326
O  3.418737 0.601868 -0.559064
N  1.500263 -0.225691 0.479662
N  -0.884065 -0.681318 0.298431
N  2.614175 3.305824 -0.353932
C  0.180995 -0.035412 1.106444
C  1.832526 -1.614956 0.326584
C  0.737564 -2.517811 0.161612
C  -0.662894 -2.03395 -0.059454
C  2.31073 0.832172 -0.008352
C  -2.115172 0.009649 0.042678
C  1.753975 2.260137 0.20152
C  3.158356 -2.110985 0.358574
C  0.985185 -3.909395 0.066539
C  3.38117 -3.500565 0.264338
C  2.299982 -4.405698 0.126847
C  -2.58266 0.979751 0.970355
C  -2.864283 -0.245637 -1.137718
C  3.903941 3.463152 0.349641
C  1.895699 4.585334 -0.517354
C  -3.763173 1.687225 0.682077
C  -4.050806 0.47298 -1.382574
C  -4.518331 1.458897 -0.4809
H  -0.046416 1.031063 1.203186
H  0.209865 -0.487981 2.118075
H  1.562052 2.403495 1.302999
H  0.769298 2.327182 -0.302257
H  3.995028 -1.418163 0.448337
H  0.125972 -4.570957 -0.082799
H  4.408895 -3.878041 0.301572
H  2.487009 -5.48184 0.05567
H  -2.070809 1.158976 1.920186
H  -2.525649 -1.007149 -1.841088
H  4.457946 2.513113 0.316632
H  3.781149 3.783238 1.416685
H  4.507147 4.227767 -0.169837
H  1.573017 5.048031 0.450442
H  0.99869 4.439179 -1.145673
H  2.554565 5.306565 -1.031774
H  -4.620778 0.271377 -2.295405
H  -5.434811 2.021751 -0.675955
