program: Orca
programVersion: 4.2.1
elementType: Cl Cl O N C C C C C C C C C H H H H H H H H H
charge: 0
multiplicity: 1
keywords: wb97x-d3
keywords: def2-TZVPP
keywords: def2/J RIJCOSX GRIDX6 NOFINALGRIDX
keywords: grid4 nofinalgrid
keywords: scfconv7
keywords: smallprint printgap noloewdin
keywords: NOSOSCF
formula: C9H9Cl2NO
InChI: InChI=1/C9H9Cl2NO/c1-2-9(13)12-6-3-4-7(10)8(11)5-6/h3-5,12H,2H2,1H3
22 atoms
Cl 2.589817 -1.939707 -0.184043
Cl 3.594708 1.033544 0.167577
O  -3.249961 1.728827 0.09382
N  -2.164645 -0.256152 -0.131181
C  -0.822553 0.116798 -0.054082
C  -4.597973 -0.21506 -0.202694
C  -3.281789 0.529405 -0.052593
C  0.119371 -0.907093 -0.139461
C  -0.377515 1.429694 0.100498
C  -4.633746 -1.679973 0.215669
C  1.474095 -0.637642 -0.073553
C  0.980426 1.685536 0.165905
C  1.918111 0.66952 0.081324
H  -5.329789 0.35455 0.369633
H  -4.901858 -0.119126 -1.249508
H  -2.319378 -1.242457 -0.253652
H  -0.197448 -1.936109 -0.258743
H  -1.076013 2.245897 0.169691
H  -4.275534 -1.822209 1.235374
H  -4.052409 -2.327026 -0.444983
H  -5.655754 -2.053346 0.176932
H  1.320321 2.70487 0.28597
totalener: -1398.83909698 hartree
nucrepener: 934.60538244 hartree
electener: -2333.44447942 hartree
oneelecener: -3776.27851663 hartree
twoeener: 1442.83403721 hartree
kineticenergy: 1395.45813979 hartree
xcener: -88.732792921666 hartree
chargesum: -0.0000000
charge: -0.052904 -0.057124 -0.391997 -0.176758 0.206780 -0.111690 0.321700 -0.196752 -0.210326 -0.278726 0.077429 -0.078695 -0.009558 0.092422 0.083923 0.142664 0.089431 0.157455 0.106028 0.065087 0.099812 0.121797
qa: -0.0529 -0.0571 -0.3920 -0.1768 0.2068 -0.1117 0.3217 -0.1968 -0.2103 -0.2787 0.0774 -0.0787 -0.0096 0.0924 0.0839 0.1427 0.0894 0.1575 0.1060 0.0651 0.0998 0.1218
va: 1.2664 1.2610 2.1165 3.2420 3.9006 3.8565 4.1438 4.0625 4.0402 3.9319 4.0509 3.9763 3.9931 1.0212 1.0059 1.0305 1.0367 1.0379 0.9997 1.0022 1.0066 1.0131
dispcorr: -0.008086809 hartree
energy: -1398.847183784358
dipole: -33.19750 31.97338 -1.22412 -2.68518 1.58033 -1.10484 0.06209 -0.21261 -0.15052
magnitude: 1.65584 au
magnitude: 4.20881 debye
