program: Orca
programVersion: 4.2.1
elementType: Cl Cl O N C C C C C C C C C H H H H H H H H H
charge: 0
multiplicity: 1
keywords: wb97x-d3
keywords: def2-TZVPP
keywords: def2/J RIJCOSX GRIDX6 NOFINALGRIDX
keywords: grid4 nofinalgrid
keywords: scfconv7
keywords: smallprint printgap noloewdin
keywords: NOSOSCF
formula: C9H9Cl2NO
InChI: InChI=1/C9H9Cl2NO/c1-2-9(13)12-6-3-4-7(10)8(11)5-6/h3-5,12H,2H2,1H3
22 atoms
Cl 2.306965 -1.877341 0.035799
Cl 3.675246 0.953036 0.212664
O  -2.681156 -1.666252 -0.352989
N  -2.198036 0.557621 -0.282636
C  -0.808989 0.579019 -0.167627
C  -4.510923 -0.115877 -0.391276
C  -3.04868 -0.515679 -0.353083
C  -0.017044 -0.565447 -0.128244
C  -0.19276 1.829155 -0.089398
C  -5.018781 0.313011 0.985323
C  1.359823 -0.444673 -0.010644
C  1.177294 1.936183 0.026578
C  1.970612 0.800202 0.067762
H  -4.668425 0.688138 -1.116083
H  -5.074043 -0.978945 -0.743025
H  -2.632046 1.465812 -0.301554
H  -0.456614 -1.547079 -0.189053
H  -0.787868 2.734225 -0.118328
H  -4.878798 -0.481298 1.717296
H  -6.082386 0.54351 0.943992
H  -4.505962 1.200454 1.357757
H  1.639494 2.911411 0.086187
totalener: -1398.83904952 hartree
nucrepener: 938.49419640 hartree
electener: -2337.33324592 hartree
oneelecener: -3784.20917609 hartree
twoeener: 1446.87593017 hartree
kineticenergy: 1395.45911867 hartree
xcener: -88.730967167249 hartree
chargesum: -0.0000000
charge: -0.047443 -0.057352 -0.379377 -0.171888 0.190314 -0.143819 0.336106 -0.182796 -0.211812 -0.248421 0.088769 -0.087619 -0.012856 0.071398 0.094587 0.130117 0.150904 0.098648 0.104228 0.091793 0.067530 0.118988
qa: -0.0474 -0.0574 -0.3794 -0.1719 0.1903 -0.1438 0.3361 -0.1828 -0.2118 -0.2484 0.0888 -0.0876 -0.0129 0.0714 0.0946 0.1301 0.1509 0.0986 0.1042 0.0918 0.0675 0.1190
va: 1.2721 1.2615 2.1216 3.2303 3.9238 3.8795 4.0841 4.0296 4.0280 3.9226 3.9787 4.0475 4.0033 1.0106 1.0245 1.0318 1.0539 1.0148 1.0023 1.0061 1.0091 1.0144
dispcorr: -0.008152765 hartree
energy: -1398.847202283375
dipole: -33.87237 32.34363 -1.52874 7.32986 -5.67479 1.65507 1.19240 -1.18919 0.00321
magnitude: 2.25307 au
magnitude: 5.72685 debye
