program: Orca
programVersion: 5.0.3
elementType: S N N N N N C C C C C C C C C C H H H H H H H H H H H H H H H H H H H
charge: 0
multiplicity: 1
keywords: wb97x-d3
keywords: def2-TZVPP
keywords: def2/J RIJCOSX
keywords: DEFGRID2
keywords: scfconv7
keywords: smallprint printgap noloewdin
keywords: NOSOSCF
formula: C10H19N5S
InChI: InChI=1/C10H19N5S/c1-6(2)11-8-13-9(12-7(3)4)15-10(14-8)16-5/h6-7,11-12H,1-5H3
35 atoms
S  3.539661 -0.843625 -0.06603
N  -1.259498 -1.937269 0.243484
N  0.011508 2.479211 0.159218
N  -0.697824 0.28986 0.159557
N  1.602677 0.855486 0.042744
N  0.950456 -1.415538 0.087675
C  -2.695504 -1.721432 0.193937
C  -1.317522 3.063391 0.088203
C  -3.387174 -2.846917 0.945131
C  -3.198129 -1.618112 -1.24011
C  -1.69972 3.388749 -1.349867
C  -1.375003 4.299828 0.971405
C  -0.325326 -0.986248 0.155214
C  0.298561 1.17394 0.113355
C  1.836811 -0.445698 0.032932
C  3.54463 -2.645009 -0.073339
H  -2.90359 -0.782674 0.706686
H  -2.016013 2.324918 0.478151
H  -0.932972 -2.887934 0.155303
H  0.792321 3.108771 0.045591
H  -3.073043 -2.883936 1.988198
H  -3.173373 -3.815798 0.488739
H  -4.467067 -2.703159 0.925503
H  -3.033565 -2.552842 -1.778747
H  -4.267774 -1.406659 -1.254901
H  -2.692599 -0.819204 -1.782477
H  -1.664469 2.500269 -1.98069
H  -2.712242 3.791493 -1.394726
H  -1.023994 4.133701 -1.77368
H  -2.36886 4.745377 0.929558
H  -0.659595 5.055695 0.641377
H  -1.160614 4.057332 2.011977
H  3.019483 -3.046014 -0.935822
H  3.125902 -3.0549 0.841544
H  4.591009 -2.940798 -0.137889
elementType: S N C H
totalener: -1064.60940888 hartree
nucrepener: 1253.48766173 hartree
electener: -2318.09707061 hartree
oneelecener: -3943.80698885 hartree
twoeener: 1625.70991824 hartree
cpcmener: -0.02380348 hartree
kineticenergy: 1060.91462050 hartree
xcener: -84.953300514572 hartree
chargesum: 0.0000000
charge: -0.055414 -0.199871 -0.194178 -0.469768 -0.431957 -0.452174 0.130964 0.120283 -0.260898 -0.281066 -0.279293 -0.259360 0.374375 0.378272 0.237157 -0.248514 0.059603 0.067274 0.163225 0.160613 0.096413 0.090803 0.087397 0.087521 0.092477 0.089025 0.090988 0.091196 0.088889 0.086766 0.090512 0.093444 0.113070 0.112679 0.129546
qa: -0.0554 -0.1999 -0.1942 -0.4698 -0.4320 -0.4522 0.1310 0.1203 -0.2609 -0.2811 -0.2793 -0.2594 0.3744 0.3783 0.2372 -0.2485 0.0596 0.0673 0.1632 0.1606 0.0964 0.0908 0.0874 0.0875 0.0925 0.0890 0.0910 0.0912 0.0889 0.0868 0.0905 0.0934 0.1131 0.1127 0.1295
va: 2.3977 3.1926 3.1870 2.9301 2.9691 2.9551 3.8390 3.8427 3.9180 3.9338 3.9424 3.9235 4.2469 4.2600 4.2800 3.9708 1.0224 1.0249 1.0264 1.0281 1.0085 1.0029 1.0053 1.0064 1.0059 1.0098 1.0072 1.0061 1.0054 1.0053 1.0031 1.0090 1.0096 1.0098 1.0023
dispcorr: -0.013392926 hartree
energy: -1064.622801803648
dipole: -22.99554 21.25637 -1.73917 2.70643 -3.11118 -0.40475 -1.98719 1.87834 -0.10886
magnitude: 1.78896 au
magnitude: 4.54718 debye
