program: Orca
programVersion: 5.0.3
elementType: S N N N N N C C C C C C C C C C H H H H H H H H H H H H H H H H H H H
charge: 0
multiplicity: 1
keywords: wb97x-d3
keywords: def2-TZVPP
keywords: def2/J RIJCOSX
keywords: DEFGRID2
keywords: scfconv7
keywords: smallprint printgap noloewdin
keywords: NOSOSCF
formula: C10H19N5S
InChI: InChI=1/C10H19N5S/c1-6(2)11-8-13-9(12-7(3)4)15-10(14-8)16-5/h6-7,11-12H,1-5H3
35 atoms
S  3.56148 -0.849243 -0.014479
N  -1.247357 -1.93494 0.180737
N  0.020456 2.475821 0.124235
N  -0.681643 0.288625 0.1218
N  1.619753 0.854606 0.055761
N  0.967791 -1.41495 0.086143
C  -2.682839 -1.709539 0.186317
C  -1.315304 3.047093 0.108687
C  -3.357128 -2.889798 0.866325
C  -3.22477 -1.490923 -1.220233
C  -1.804532 3.281038 -1.314506
C  -1.314323 4.334004 0.917168
C  -0.308733 -0.987171 0.126757
C  0.315012 1.17306 0.098575
C  1.854872 -0.445166 0.049528
C  3.543044 -2.65129 0.001617
H  -2.873097 -0.811744 0.77686
H  -1.978628 2.331261 0.593563
H  -0.917598 -2.886858 0.125504
H  0.801824 3.109647 0.044833
H  -2.992168 -3.027275 1.885076
H  -3.18462 -3.817433 0.315127
H  -4.434567 -2.732572 0.916123
H  -3.048463 -2.36567 -1.849143
H  -4.300503 -1.309519 -1.192539
H  -2.757032 -0.629542 -1.697568
H  -1.817031 2.354827 -1.889616
H  -2.819406 3.682072 -1.310177
H  -1.165165 3.995773 -1.836567
H  -2.314378 4.767625 0.938236
H  -0.642996 5.078114 0.482398
H  -1.004162 4.158439 1.947667
H  3.040403 -3.058119 -0.872705
H  3.082915 -3.041714 0.906379
H  4.58655 -2.96437 -0.020693
elementType: S N C H
totalener: -1064.62039488 hartree
nucrepener: 1255.20720559 hartree
electener: -2319.82760046 hartree
oneelecener: -3947.19179827 hartree
twoeener: 1627.36419781 hartree
cpcmener: -0.02067529 hartree
kineticenergy: 1060.90570508 hartree
xcener: -84.951829003874 hartree
chargesum: -0.0000000
charge: -0.052267 -0.200132 -0.194312 -0.469811 -0.426122 -0.449173 0.124758 0.121078 -0.261141 -0.275376 -0.277435 -0.258460 0.378388 0.381547 0.237797 -0.250276 0.056818 0.062194 0.161035 0.159754 0.099697 0.088663 0.087403 0.085460 0.090646 0.088500 0.089727 0.089680 0.087365 0.086281 0.089182 0.096585 0.112420 0.112053 0.127471
qa: -0.0523 -0.2001 -0.1943 -0.4698 -0.4261 -0.4492 0.1248 0.1211 -0.2611 -0.2754 -0.2774 -0.2585 0.3784 0.3815 0.2378 -0.2503 0.0568 0.0622 0.1610 0.1598 0.0997 0.0887 0.0874 0.0855 0.0906 0.0885 0.0897 0.0897 0.0874 0.0863 0.0892 0.0966 0.1124 0.1121 0.1275
va: 2.3949 3.1873 3.1840 2.9288 2.9767 2.9570 3.8479 3.8460 3.9166 3.9189 3.9350 3.9198 4.2415 4.2519 4.2773 3.9707 1.0219 1.0245 1.0291 1.0299 1.0079 1.0028 1.0056 1.0086 1.0062 1.0109 1.0083 1.0062 1.0071 1.0056 1.0030 1.0086 1.0096 1.0101 1.0029
dispcorr: -0.013531241 hartree
energy: -1064.633926117393
dipole: -23.24370 21.52631 -1.71739 2.73165 -3.10153 -0.36988 -1.89148 1.90021 0.00874
magnitude: 1.75679 au
magnitude: 4.46541 debye
