program: Orca
programVersion: 5.0.3
elementType: O N N N N N C C C C C C C C C C H H H H H H H H H H H H H H H H H H H
charge: 0
multiplicity: 1
keywords: wb97x-d3
keywords: def2-TZVPP
keywords: def2/J RIJCOSX
keywords: DEFGRID2
keywords: scfconv7
keywords: smallprint printgap noloewdin
keywords: NOSOSCF
formula: C10H19N5O
InChI: InChI=1/C10H19N5O/c1-6(2)11-8-13-9(12-7(3)4)15-10(14-8)16-5/h6-7,11-12H,1-5H3
35 atoms
O  -0.341607 3.512475 0.051155
N  -2.336452 -0.510457 0.079397
N  2.239773 -0.230275 -0.18077
N  -0.042286 -0.439638 -0.029702
N  1.008763 1.682632 -0.061785
N  -1.345328 1.537768 0.064009
C  -2.443661 -1.957398 0.03325
C  2.519623 -1.653884 -0.111884
C  -3.125502 -2.403733 -1.253374
C  -3.176897 -2.469683 1.264824
C  2.948518 -2.058057 1.292917
C  3.571869 -2.019705 -1.147243
C  -1.207589 0.204149 0.035311
C  1.033287 0.33759 -0.085281
C  -0.201259 2.193999 0.015931
C  0.824051 4.324646 0.019401
H  -1.426831 -2.346899 0.043801
H  1.59369 -2.171733 -0.359686
H  -3.194762 0.019652 0.114062
H  3.0273 0.400469 -0.155056
H  -2.582625 -2.05262 -2.131811
H  -4.14834 -2.025041 -1.31379
H  -3.172241 -3.492662 -1.304272
H  -3.227889 -3.559386 1.253224
H  -2.667893 -2.169062 2.181348
H  -4.200841 -2.091238 1.305438
H  2.18137 -1.810676 2.027895
H  3.127493 -3.133055 1.348824
H  3.87155 -1.55135 1.583337
H  4.518365 -1.509563 -0.953659
H  3.244483 -1.758609 -2.154196
H  3.76678 -3.092577 -1.127207
H  1.39822 4.18066 -0.896323
H  1.471797 4.141556 0.877466
H  0.468555 5.351996 0.05676
elementType: O N C H
totalener: -741.64885996 hartree
nucrepener: 1153.38107736 hartree
electener: -1895.02993732 hartree
oneelecener: -3296.81589710 hartree
twoeener: 1401.78595978 hartree
cpcmener: -0.02275094 hartree
kineticenergy: 738.34443724 hartree
xcener: -71.995780249911 hartree
chargesum: 0.0000000
charge: -0.296542 -0.191999 -0.197656 -0.471189 -0.473795 -0.440222 0.103921 0.109947 -0.265493 -0.263943 -0.272549 -0.259711 0.380868 0.368966 0.416539 -0.116285 0.073401 0.070364 0.156533 0.158426 0.092189 0.086856 0.087085 0.086479 0.092369 0.088054 0.092093 0.088992 0.086616 0.089214 0.093622 0.086545 0.106830 0.107552 0.125924
qa: -0.2965 -0.1920 -0.1977 -0.4712 -0.4738 -0.4402 0.1039 0.1099 -0.2655 -0.2639 -0.2725 -0.2597 0.3809 0.3690 0.4165 -0.1163 0.0734 0.0704 0.1565 0.1584 0.0922 0.0869 0.0871 0.0865 0.0924 0.0881 0.0921 0.0890 0.0866 0.0892 0.0936 0.0865 0.1068 0.1076 0.1259
va: 2.0804 3.1833 3.1802 2.9375 2.9115 2.9440 3.8496 3.8522 3.9399 3.9374 3.9416 3.9283 4.2517 4.2673 4.3045 3.8680 1.0288 1.0239 1.0310 1.0289 1.0078 1.0044 1.0058 1.0056 1.0084 1.0039 1.0075 1.0063 1.0055 1.0034 1.0088 1.0055 0.9979 0.9978 0.9955
dispcorr: -0.012726496 hartree
energy: -741.661586456135
dipole: 3.72109 -2.84113 0.87996 -17.44207 16.19866 -1.24340 0.35744 -0.36865 -0.01121
magnitude: 1.52332 au
magnitude: 3.87197 debye
