program: Orca
programVersion: 4.2.1
elementType: O O O O N N C C C C C C C C C C C C C C C C H H H H H H H H H H H H H H H H
charge: 0
multiplicity: 1
keywords: wb97x-d3
keywords: def2-TZVPP
keywords: def2/J RIJCOSX GRIDX6 NOFINALGRIDX
keywords: grid4 nofinalgrid
keywords: scfconv7
keywords: smallprint printgap noloewdin
keywords: NOSOSCF
formula: C16H16N2O4
InChI: InChI=1/C16H16N2O4/c1-11-5-3-6-12(9-11)18-16(20)22-14-8-4-7-13(10-14)17-15(19)21-2/h3-10,17-18H,1-2H3
38 atoms
O  -0.277726 -1.774449 0.654313
O  -0.889803 -0.337028 -0.973981
O  5.149862 1.98574 0.205444
O  3.000107 1.803517 0.837562
N  -2.293537 -0.892291 0.750535
N  4.126183 0.074885 -0.161353
C  -3.444869 -0.142616 0.475615
C  -4.663017 1.635752 -0.623303
C  -3.483742 0.921964 -0.422317
C  3.160599 -0.927106 -0.239602
C  0.99482 -1.874224 0.114709
C  -4.59661 -0.487043 1.182311
C  -5.808188 1.278264 0.081893
C  1.867702 -0.808419 0.263867
C  -5.766875 0.223973 0.982536
C  -4.677239 2.803027 -1.565593
C  3.54332 -2.11759 -0.865471
C  1.353026 -3.055454 -0.502629
C  2.65039 -3.164699 -0.987111
C  -1.146233 -0.932785 0.044478
C  3.998167 1.329486 0.338904
C  5.187691 3.324142 0.698243
H  -2.601489 1.216059 -0.969215
H  -4.576357 -1.312234 1.88395
H  -6.730735 1.824718 -0.070789
H  1.536758 0.084168 0.770355
H  -6.656211 -0.053503 1.532805
H  -2.352029 -1.508296 1.549293
H  4.548577 -2.220734 -1.255416
H  0.646585 -3.868606 -0.599064
H  -5.647786 2.917156 -2.047432
H  -4.470226 3.734382 -1.034422
H  -3.92337 2.701813 -2.345561
H  2.967144 -4.078311 -1.471333
H  5.028798 -0.160272 -0.548969
H  6.191359 3.68494 0.493819
H  5.007191 3.361104 1.772174
H  4.468444 3.962236 0.185473
elementType: O N C H
totalener: -1029.90537029 hartree
nucrepener: 1663.17707977 hartree
electener: -2693.08245005 hartree
oneelecener: -4706.43413597 hartree
twoeener: 2013.35168592 hartree
cpcmener: -0.04338649 hartree
kineticenergy: 1025.58439737 hartree
xcener: -97.687691596656 hartree
chargesum: 0.0000000
charge: -0.337395 -0.494125 -0.325027 -0.522986 -0.139215 -0.140491 0.175678 0.015375 -0.231773 0.176323 0.239136 -0.242119 -0.221574 -0.220290 -0.113499 -0.209341 -0.232707 -0.235867 -0.103447 0.521632 0.549898 -0.119046 0.140682 0.140343 0.142421 0.157343 0.161595 0.173754 0.142480 0.155536 0.095912 0.106056 0.096016 0.164524 0.170228 0.129270 0.117435 0.117267
qa: -0.3374 -0.4941 -0.3250 -0.5230 -0.1392 -0.1405 0.1757 0.0154 -0.2318 0.1763 0.2391 -0.2421 -0.2216 -0.2203 -0.1135 -0.2093 -0.2327 -0.2359 -0.1034 0.5216 0.5499 -0.1190 0.1407 0.1403 0.1424 0.1573 0.1616 0.1738 0.1425 0.1555 0.0959 0.1061 0.0960 0.1645 0.1702 0.1293 0.1174 0.1173
va: 2.0816 2.0075 2.0740 1.9799 3.2601 3.2487 3.8251 3.7616 3.9482 3.8670 3.7910 3.9488 3.9336 4.0149 3.8939 3.9002 3.9293 4.0283 3.8929 4.2342 4.2263 3.8597 1.0398 1.0083 1.0004 1.0395 0.9886 1.0194 1.0075 0.9985 1.0010 0.9932 1.0023 0.9866 1.0212 0.9951 0.9929 0.9931
dispcorr: -0.014122097 hartree
energy: -1029.919492385378
dipole: -6.07808 7.22165 1.14357 9.57779 -10.25573 -0.67795 -2.27641 2.79493 0.51852
magnitude: 1.42697 au
magnitude: 3.62706 debye
