program: Orca
programVersion: 4.2.1
elementType: O O O O N N C C C C C C C C C C C C C C C C H H H H H H H H H H H H H H H H
charge: 0
multiplicity: 1
keywords: wb97x-d3
keywords: def2-TZVPP
keywords: def2/J RIJCOSX GRIDX6 NOFINALGRIDX
keywords: grid4 nofinalgrid
keywords: scfconv7
keywords: smallprint printgap noloewdin
keywords: NOSOSCF
formula: C16H16N2O4
InChI: InChI=1/C16H16N2O4/c1-11-5-3-6-12(9-11)18-16(20)22-14-8-4-7-13(10-14)17-15(19)21-2/h3-10,17-18H,1-2H3
38 atoms
O  -0.404304 0.031143 0.765235
O  -1.430946 -1.030074 -0.9467
O  6.12732 1.677168 -0.43328
O  6.054223 -0.564988 -0.288482
N  -2.574884 0.286362 0.540638
N  4.161569 0.724811 -0.185787
C  -3.902772 0.183627 0.108108
C  -6.158683 1.047402 0.371768
C  -4.808717 1.074637 0.688725
C  3.154166 -0.213097 0.037971
C  0.816128 -0.553272 0.486146
C  -4.35954 -0.752432 -0.814679
C  -6.607407 0.106964 -0.555882
C  1.869819 0.300938 0.232765
C  -5.711706 -0.774268 -1.134963
C  -7.118623 2.003877 1.013311
C  3.34609 -1.593535 0.074498
C  0.989491 -1.926986 0.544683
C  2.263355 -2.424166 0.328316
C  -1.483868 -0.311004 0.021349
C  5.496537 0.51089 -0.300986
C  7.547651 1.629475 -0.557645
H  -4.447133 1.802362 1.407185
H  -3.695596 -1.462423 -1.279762
H  -7.656782 0.066275 -0.820976
H  1.697685 1.370363 0.205254
H  -6.064415 -1.504738 -1.851433
H  -2.418344 0.899004 1.328719
H  4.317216 -2.03134 -0.082409
H  0.167405 -2.592869 0.766882
H  -7.863571 1.47268 1.607838
H  -6.610159 2.707402 1.670834
H  -7.662343 2.580052 0.263579
H  2.425581 -3.492966 0.363793
H  3.86427 1.689923 -0.20004
H  8.013069 1.187735 0.323051
H  7.870199 2.662487 -0.64893
H  7.855266 1.080087 -1.446875
elementType: O N C H
totalener: -1029.90472985 hartree
nucrepener: 1617.13531744 hartree
electener: -2647.04004730 hartree
oneelecener: -4613.35708367 hartree
twoeener: 1966.31703637 hartree
cpcmener: -0.04238864 hartree
kineticenergy: 1025.58038091 hartree
xcener: -97.687463149323 hartree
chargesum: 0.0000000
charge: -0.331409 -0.490397 -0.325500 -0.521145 -0.138443 -0.145567 0.183552 0.028552 -0.215246 0.182329 0.258827 -0.254603 -0.234264 -0.210654 -0.128073 -0.205726 -0.252827 -0.219548 -0.130318 0.522599 0.550110 -0.117980 0.123240 0.155971 0.143864 0.134633 0.160055 0.172376 0.161730 0.150060 0.104539 0.091244 0.103221 0.162804 0.169346 0.116723 0.129220 0.116702
qa: -0.3314 -0.4904 -0.3255 -0.5211 -0.1384 -0.1456 0.1836 0.0286 -0.2152 0.1823 0.2588 -0.2546 -0.2343 -0.2107 -0.1281 -0.2057 -0.2528 -0.2195 -0.1303 0.5226 0.5501 -0.1180 0.1232 0.1560 0.1439 0.1346 0.1601 0.1724 0.1617 0.1501 0.1045 0.0912 0.1032 0.1628 0.1693 0.1167 0.1292 0.1167
va: 2.0888 2.0149 2.0723 1.9814 3.2645 3.2446 3.8140 3.7502 3.9564 3.8614 3.7865 3.9489 3.9389 4.0391 3.9103 3.8937 3.9408 3.9887 3.9265 4.2359 4.2290 3.8602 1.0169 1.0288 0.9999 1.0179 0.9906 1.0216 1.0305 1.0036 0.9944 1.0072 0.9955 0.9901 1.0227 0.9934 0.9949 0.9932
dispcorr: -0.013835235 hartree
energy: -1029.918565086991
dipole: -9.47948 8.92643 -0.55304 5.93549 -3.56851 2.36698 1.56291 -0.30009 1.26282
magnitude: 2.73919 au
magnitude: 6.96248 debye
