program: Orca
programVersion: 4.2.1
elementType: O O O O N N C C C C C C C C C C C C C C C C H H H H H H H H H H H H H H H H
charge: 0
multiplicity: 1
keywords: wb97x-d3
keywords: def2-TZVPP
keywords: def2/J RIJCOSX GRIDX6 NOFINALGRIDX
keywords: grid4 nofinalgrid
keywords: scfconv7
keywords: smallprint printgap noloewdin
keywords: NOSOSCF
formula: C16H16N2O4
InChI: InChI=1/C16H16N2O4/c1-11-5-3-6-12(9-11)18-16(20)22-14-8-4-7-13(10-14)17-15(19)21-2/h3-10,17-18H,1-2H3
38 atoms
O  -0.151793 -0.341576 0.799885
O  -1.370351 -1.314888 -0.837417
O  6.086541 1.251745 -0.492565
O  4.003622 1.920139 0.027037
N  -2.282949 0.175247 0.640931
N  4.526087 -0.285321 -0.311638
C  -3.614627 0.238358 0.207529
C  -5.664629 1.538657 0.185041
C  -4.328435 1.392209 0.532348
C  3.325087 -0.939988 -0.042867
C  0.991126 -1.050484 0.47782
C  -4.250042 -0.793825 -0.475575
C  -6.288974 0.505688 -0.512582
C  2.115929 -0.290916 0.200008
C  -5.583185 -0.641827 -0.832518
C  -6.425478 2.773774 0.564161
C  3.363147 -2.335683 -0.031682
C  1.015043 -2.433328 0.512865
C  2.220827 -3.064144 0.243249
C  -1.291536 -0.565106 0.10431
C  4.796549 1.041644 -0.234797
C  6.540456 2.603338 -0.450197
H  -3.826537 2.191631 1.066363
H  -3.73629 -1.708838 -0.723845
H  -7.328388 0.599919 -0.801777
H  2.033765 0.783975 0.189753
H  -6.075625 -1.444263 -1.36594
H  -2.019334 0.833928 1.359428
H  4.294823 -2.851071 -0.2287
H  0.134455 -3.010939 0.755849
H  -5.760692 3.585443 0.85612
H  -7.045895 3.126303 -0.259759
H  -7.092817 2.577948 1.405458
H  2.272202 -4.144199 0.257129
H  5.309902 -0.887552 -0.518288
H  6.38319 3.050423 0.530681
H  6.054646 3.213418 -1.210964
H  7.606124 2.562758 -0.654577
elementType: O N C H
totalener: -1029.90499531 hartree
nucrepener: 1633.93607667 hartree
electener: -2663.84107198 hartree
oneelecener: -4647.50558058 hartree
twoeener: 1983.66450860 hartree
cpcmener: -0.04228509 hartree
kineticenergy: 1025.59196040 hartree
xcener: -97.689129419521 hartree
chargesum: 0.0000000
charge: -0.328377 -0.489528 -0.324803 -0.522418 -0.152398 -0.144239 0.183007 0.025868 -0.215287 0.181277 0.237100 -0.246491 -0.223842 -0.231025 -0.128568 -0.206298 -0.227935 -0.210015 -0.116777 0.520380 0.549703 -0.119506 0.124863 0.148991 0.143726 0.150070 0.160070 0.176218 0.140517 0.148280 0.093006 0.100804 0.105975 0.163133 0.170626 0.116533 0.118135 0.129227
qa: -0.3284 -0.4895 -0.3248 -0.5224 -0.1524 -0.1442 0.1830 0.0259 -0.2153 0.1813 0.2371 -0.2465 -0.2238 -0.2310 -0.1286 -0.2063 -0.2279 -0.2100 -0.1168 0.5204 0.5497 -0.1195 0.1249 0.1490 0.1437 0.1501 0.1601 0.1762 0.1405 0.1483 0.0930 0.1008 0.1060 0.1631 0.1706 0.1165 0.1181 0.1292
va: 2.0957 2.0149 2.0740 1.9800 3.2503 3.2472 3.7756 3.7457 3.9778 3.8604 3.8126 3.9658 3.9353 4.0285 3.9126 3.8927 3.9343 3.9747 3.9064 4.2427 4.2298 3.8601 1.0166 1.0255 1.0000 1.0446 0.9906 1.0186 1.0078 1.0049 1.0053 0.9979 0.9934 0.9885 1.0209 0.9934 0.9927 0.9952
dispcorr: -0.013923463 hartree
energy: -1029.918918771495
dipole: -8.24131 9.40698 1.16566 7.62657 -7.35910 0.26746 0.48031 0.38134 0.86164
magnitude: 1.47402 au
magnitude: 3.74666 debye
