program: Orca
programVersion: 4.2.1
elementType: O O O O N N C C C C C C C C C C C C C C C C H H H H H H H H H H H H H H H H
charge: 0
multiplicity: 1
keywords: wb97x-d3
keywords: def2-TZVPP
keywords: def2/J RIJCOSX GRIDX6 NOFINALGRIDX
keywords: grid4 nofinalgrid
keywords: scfconv7
keywords: smallprint printgap noloewdin
keywords: NOSOSCF
formula: C16H16N2O4
InChI: InChI=1/C16H16N2O4/c1-11-5-3-6-12(9-11)18-16(20)22-14-8-4-7-13(10-14)17-15(19)21-2/h3-10,17-18H,1-2H3
38 atoms
O  -0.434405 -0.543968 1.013214
O  -1.450046 -0.141325 -0.963701
O  6.050282 1.662398 0.570148
O  5.917323 -0.20239 -0.675651
N  -2.601239 -0.169198 1.019047
N  4.104436 0.646558 0.442824
C  -3.921922 0.096825 0.634156
C  -5.721856 0.264316 -0.973794
C  -4.383325 0.018791 -0.67963
C  3.088532 -0.252012 0.118228
C  0.769547 -0.821525 0.392229
C  -4.812382 0.420496 1.65594
C  -6.601823 0.589173 0.05577
C  1.82676 0.026172 0.651095
C  -6.143624 0.662507 1.361523
C  -6.217425 0.160347 -2.386002
C  3.253237 -1.380266 -0.684463
C  0.914344 -1.950239 -0.397636
C  2.166281 -2.208138 -0.928709
C  -1.509883 -0.271125 0.234968
C  5.402321 0.624125 0.046115
C  7.430089 1.796749 0.231322
H  -3.715431 -0.241186 -1.486198
H  -4.46386 0.481816 2.679857
H  -7.644956 0.780271 -0.164339
H  1.675447 0.897548 1.277156
H  -6.826468 0.911847 2.163011
H  -2.447605 -0.257523 2.01374
H  4.208198 -1.628924 -1.114923
H  0.083878 -2.617555 -0.583559
H  -5.403243 -0.008647 -3.089206
H  -6.924212 -0.664179 -2.493651
H  -6.739605 1.067966 -2.691009
H  2.307317 -3.082603 -1.549444
H  3.836398 1.412461 1.044054
H  7.763434 2.7124 0.710758
H  7.573011 1.885317 -0.845073
H  8.018581 0.961246 0.609629
elementType: O N C H
totalener: -1029.90473475 hartree
nucrepener: 1624.44350025 hartree
electener: -2654.34823499 hartree
oneelecener: -4628.12038634 hartree
twoeener: 1973.77215134 hartree
cpcmener: -0.04224065 hartree
kineticenergy: 1025.57901270 hartree
xcener: -97.686922122577 hartree
chargesum: -0.0000000
charge: -0.333911 -0.492092 -0.325283 -0.521397 -0.139535 -0.143393 0.175573 0.017216 -0.228183 0.185225 0.256820 -0.240362 -0.233219 -0.213985 -0.109149 -0.208293 -0.253459 -0.220356 -0.129152 0.522401 0.549376 -0.118211 0.141273 0.139883 0.143052 0.134851 0.160938 0.173623 0.163293 0.153266 0.091453 0.104407 0.101917 0.163207 0.169112 0.128911 0.115645 0.118539
qa: -0.3339 -0.4921 -0.3253 -0.5214 -0.1395 -0.1434 0.1756 0.0172 -0.2282 0.1852 0.2568 -0.2404 -0.2332 -0.2140 -0.1091 -0.2083 -0.2535 -0.2204 -0.1292 0.5224 0.5494 -0.1182 0.1413 0.1399 0.1431 0.1349 0.1609 0.1736 0.1633 0.1533 0.0915 0.1044 0.1019 0.1632 0.1691 0.1289 0.1156 0.1185
va: 2.0840 2.0111 2.0732 1.9808 3.2626 3.2461 3.8224 3.7616 3.9520 3.8556 3.7806 3.9446 3.9408 4.0520 3.8866 3.8980 3.9343 4.0017 3.9227 4.2354 4.2298 3.8599 1.0383 1.0084 0.9997 1.0172 0.9888 1.0196 1.0302 0.9994 1.0066 0.9944 0.9965 0.9898 1.0227 0.9952 0.9940 0.9925
dispcorr: -0.013916716 hartree
energy: -1029.918651462271
dipole: -7.99960 7.55998 -0.43962 2.71395 -1.78901 0.92494 -3.69611 5.73968 2.04358
magnitude: 2.28582 au
magnitude: 5.81010 debye
