program: Orca
programVersion: 4.2.1
elementType: O O O O N N C C C C C C C C C C C C C C C C H H H H H H H H H H H H H H H H
charge: 0
multiplicity: 1
keywords: wb97x-d3
keywords: def2-TZVPP
keywords: def2/J RIJCOSX GRIDX6 NOFINALGRIDX
keywords: grid4 nofinalgrid
keywords: scfconv7
keywords: smallprint printgap noloewdin
keywords: NOSOSCF
formula: C16H16N2O4
InChI: InChI=1/C16H16N2O4/c1-11-5-3-6-12(9-11)18-16(20)22-14-8-4-7-13(10-14)17-15(19)21-2/h3-10,17-18H,1-2H3
38 atoms
O  -0.317729 -1.605892 -0.614105
O  -0.713044 -0.321775 1.201083
O  5.289689 1.831407 0.131765
O  3.15072 1.806337 -0.553855
N  -2.26559 -0.602153 -0.462452
N  4.215037 -0.084266 0.184993
C  -3.330283 0.209098 -0.056565
C  -5.607825 0.904585 -0.54512
C  -4.493804 0.1280 -0.826405
C  3.222396 -1.058707 0.104197
C  0.988426 -1.841405 -0.238984
C  -3.286919 1.084094 1.025257
C  -5.554248 1.779477 0.539853
C  1.893921 -0.791902 -0.218224
C  -4.405653 1.858267 1.306912
C  -6.840502 0.817241 -1.394377
C  3.608589 -2.373416 0.382305
C  1.352194 -3.144996 0.037415
C  2.682765 -3.39807 0.342423
C  -1.076657 -0.785974 0.14992
C  4.125113 1.236673 -0.117988
C  5.367056 3.228563 -0.136847
H  -4.524256 -0.556412 -1.667743
H  -2.409128 1.178313 1.643267
H  -6.410786 2.397529 0.780747
H  1.565131 0.206875 -0.456878
H  -4.367904 2.539569 2.147394
H  -2.401911 -1.100427 -1.33068
H  4.640752 -2.591945 0.62779
H  0.621508 -3.942047 0.006713
H  -7.728168 0.632643 -0.787568
H  -7.012393 1.75058 -1.933973
H  -6.76963 0.018916 -2.132252
H  3.000811 -4.409519 0.557069
H  5.11584 -0.405936 0.509079
H  6.372091 3.528867 0.147251
H  4.646373 3.793642 0.454457
H  5.216265 3.444749 -1.194772
elementType: O N C H
totalener: -1029.91076804 hartree
nucrepener: 1655.37236271 hartree
electener: -2685.28313075 hartree
oneelecener: -4690.50135507 hartree
twoeener: 2005.21822432 hartree
cpcmener: -0.03545451 hartree
kineticenergy: 1025.59772166 hartree
xcener: -97.688824858877 hartree
chargesum: -0.0000000
charge: -0.333739 -0.464421 -0.321935 -0.497090 -0.140408 -0.146891 0.185899 0.031128 -0.216776 0.173383 0.245374 -0.252588 -0.233046 -0.203277 -0.122212 -0.206311 -0.233136 -0.238105 -0.103505 0.505375 0.535234 -0.118300 0.118505 0.156557 0.140265 0.152077 0.156342 0.165873 0.136763 0.150885 0.102014 0.103988 0.089334 0.159001 0.165319 0.126425 0.115577 0.116421
qa: -0.3337 -0.4644 -0.3219 -0.4971 -0.1404 -0.1469 0.1859 0.0311 -0.2168 0.1734 0.2454 -0.2526 -0.2330 -0.2033 -0.1222 -0.2063 -0.2331 -0.2381 -0.1035 0.5054 0.5352 -0.1183 0.1185 0.1566 0.1403 0.1521 0.1563 0.1659 0.1368 0.1509 0.1020 0.1040 0.0893 0.1590 0.1653 0.1264 0.1156 0.1164
va: 2.0845 2.0459 2.0743 2.0108 3.2584 3.2418 3.8330 3.7574 3.9566 3.8798 3.8039 3.9533 3.9441 3.9920 3.9111 3.8948 3.9383 4.0250 3.9107 4.2547 4.2455 3.8660 1.0178 1.0308 1.0008 1.0463 0.9918 1.0258 1.0084 1.0007 0.9961 0.9942 1.0073 0.9884 1.0241 0.9952 0.9936 0.9930
dispcorr: -0.014031861 hartree
energy: -1029.924799902405
dipole: -9.62576 10.42529 0.79952 6.18245 -6.89107 -0.70862 -2.48414 1.64833 -0.83582
magnitude: 1.35646 au
magnitude: 3.44784 debye
