program: Orca
programVersion: 4.2.1
elementType: Cl O N N C C C C C C C C C H H H H H H H H H H H
charge: 0
multiplicity: 1
keywords: wb97x-d3
keywords: def2-TZVPP
keywords: def2/J RIJCOSX GRIDX6 NOFINALGRIDX
keywords: grid4 nofinalgrid
keywords: scfconv7
keywords: smallprint printgap noloewdin
keywords: NOSOSCF
formula: C9H11ClN2O
InChI: InChI=1/C9H11ClN2O/c1-12(2)9(13)11-8-5-3-7(10)4-6-8/h3-6,11H,1-2H3
24 atoms
Cl 4.092048 -0.000491 -0.940247
O  -3.34292 -0.623768 1.730032
N  -2.792583 -0.215653 -0.428411
N  -1.359106 0.376706 1.317728
C  -0.090258 0.259538 0.745701
C  -2.549517 -0.191715 0.90304
C  0.240267 -0.72822 -0.181134
C  0.899739 1.153974 1.153908
C  -3.934514 -0.966885 -0.903642
C  -2.234663 0.724275 -1.377724
C  1.521113 -0.801704 -0.704102
C  2.185416 1.071537 0.649212
C  2.489029 0.097386 -0.288713
H  -1.36459 0.61923 2.297831
H  -0.491978 -1.459253 -0.495201
H  0.662484 1.925852 1.87571
H  -4.099574 -1.854533 -0.299441
H  -3.744246 -1.290682 -1.926159
H  -4.850365 -0.369871 -0.900411
H  -1.586997 0.235657 -2.108478
H  -1.668606 1.508895 -0.884357
H  -3.047828 1.209666 -1.921622
H  1.759342 -1.572669 -1.424538
H  2.938894 1.773443 0.980218
elementType: Cl O N C H
totalener: -994.60372281 hartree
nucrepener: 862.34464661 hartree
electener: -1856.94836942 hartree
oneelecener: -3071.94162451 hartree
twoeener: 1214.99325509 hartree
cpcmener: -0.02323814 hartree
kineticenergy: 991.59101750 hartree
xcener: -72.995083220443 hartree
chargesum: -0.0000000
charge: -0.104518 -0.535919 -0.166850 -0.187186 0.197106 0.381542 -0.247491 -0.234900 -0.178541 -0.185641 -0.130693 -0.116377 0.072992 0.165725 0.156028 0.143598 0.103206 0.111157 0.113574 0.113193 0.121161 0.122172 0.144032 0.142631
qa: -0.1045 -0.5359 -0.1669 -0.1872 0.1971 0.3815 -0.2475 -0.2349 -0.1785 -0.1856 -0.1307 -0.1164 0.0730 0.1657 0.1560 0.1436 0.1032 0.1112 0.1136 0.1132 0.1212 0.1222 0.1440 0.1426
va: 1.2008 1.9764 3.0520 3.1088 3.6665 4.3260 3.9731 4.0231 3.9065 3.8933 3.9843 3.9817 3.8313 1.0219 1.0058 1.0078 1.0089 0.9902 0.9886 0.9863 0.9974 0.9948 1.0050 1.0039
dispcorr: -0.009887446 hartree
energy: -994.613610258113
dipole: -20.10595 20.10415 -0.00180 0.65437 0.09239 0.74676 -3.30358 2.20556 -1.09801
magnitude: 1.32789 au
magnitude: 3.37522 debye
