program: Orca
programVersion: 4.2.1
elementType: Cl Cl O O N N C C C C C C C C C H H H H H H H H H H
charge: 0
multiplicity: 1
keywords: wb97x-d3
keywords: def2-TZVPP
keywords: def2/J RIJCOSX GRIDX6 NOFINALGRIDX
keywords: grid4 nofinalgrid
keywords: scfconv7
keywords: smallprint printgap noloewdin
keywords: NOSOSCF
formula: C9H10Cl2N2O2
InChI: InChI=1/C9H10Cl2N2O2/c1-13(15-2)9(14)12-6-3-4-7(10)8(11)5-6/h3-5,12H,1-2H3
25 atoms
Cl 3.126302 1.968735 -0.333957
Cl 4.266395 -0.95074 0.063563
O  -3.842568 1.244388 -0.123648
O  -2.531925 -1.960413 -0.075388
N  -1.545828 0.106312 -0.03882
N  -3.841312 -0.124433 0.077357
C  -0.19257 -0.218553 -0.024782
C  0.703802 0.838581 -0.173389
C  0.313072 -1.507407 0.148741
C  -2.609509 -0.753793 -0.035438
C  2.070193 0.625683 -0.147668
C  1.681524 -1.706131 0.171644
C  2.573977 -0.656406 0.02672
C  -5.026584 -0.767883 -0.439012
C  -4.204243 1.911826 1.073255
H  -1.763915 1.081739 -0.156605
H  0.341378 1.849547 -0.313111
H  -0.346556 -2.351193 0.259822
H  2.066405 -2.707533 0.30624
H  -5.905608 -0.361065 0.058795
H  -4.974177 -1.828876 -0.218645
H  -5.135878 -0.633186 -1.517958
H  -4.195791 2.975741 0.841464
H  -3.496612 1.710371 1.88116
H  -5.207385 1.633437 1.405519
totalener: -1529.37314644 hartree
nucrepener: 1178.09612526 hartree
electener: -2707.46927170 hartree
oneelecener: -4440.51417698 hartree
twoeener: 1733.04490528 hartree
kineticenergy: 1525.53455323 hartree
xcener: -99.888774529359 hartree
chargesum: -0.0000000
charge: -0.055918 -0.060377 -0.276934 -0.430290 -0.189545 -0.079828 0.205284 -0.203729 -0.206601 0.413509 0.082462 -0.083508 -0.007642 -0.141837 -0.095074 0.144034 0.089475 0.155252 0.120036 0.084213 0.122541 0.106778 0.115825 0.100605 0.091269
qa: -0.0559 -0.0604 -0.2769 -0.4303 -0.1895 -0.0798 0.2053 -0.2037 -0.2066 0.4135 0.0825 -0.0835 -0.0076 -0.1418 -0.0951 0.1440 0.0895 0.1553 0.1200 0.0842 0.1225 0.1068 0.1158 0.1006 0.0913
va: 1.2631 1.2576 1.8867 2.0883 3.2237 3.0634 3.9086 4.0701 4.0329 4.2839 4.0378 3.9847 3.9873 3.9379 3.8946 1.0557 1.0371 1.0330 1.0135 0.9950 1.0159 0.9949 0.9948 0.9956 0.9965
dispcorr: -0.009823947 hartree
energy: -1529.382970384570
dipole: -36.88093 35.12664 -1.75429 -0.06370 1.04477 0.98107 2.81587 -2.47309 0.34278
magnitude: 2.03900 au
magnitude: 5.18274 debye
