program: Orca
programVersion: 4.2.1
elementType: O O N N N N C C C C C C C C C C C C H H H H H H H H H H H H H H H H H H H H
charge: 0
multiplicity: 1
keywords: wb97x-d3
keywords: def2-TZVPP
keywords: def2/J RIJCOSX GRIDX6 NOFINALGRIDX
keywords: grid4 nofinalgrid
keywords: scfconv7
keywords: smallprint printgap noloewdin
keywords: NOSOSCF
formula: C12H20N4O2
InChI: InChI=1/C12H20N4O2/c1-14(2)10-13-11(17)16(12(18)15(10)3)9-7-5-4-6-8-9/h9H,4-8H2,1-3H3
38 atoms
O  0.177151 -2.318268 0.024588
O  0.510365 2.190098 0.384233
N  0.424732 -0.050989 0.010682
N  -1.682792 -1.056322 0.17722
N  -1.520253 1.270533 0.114685
N  -3.571972 0.297988 -0.082373
C  1.889704 -0.177576 -0.119807
C  2.454048 0.602124 -1.304737
C  2.629993 0.122744 1.181748
C  3.942924 0.297689 -1.454381
C  4.119901 -0.162902 1.012514
C  4.705474 0.601698 -0.169445
C  -0.310853 -1.207478 0.055759
C  -0.174248 1.200751 0.20339
C  -2.240924 0.191112 0.058703
C  -2.41796 -2.234357 0.631205
C  -4.365499 -0.629249 -0.873524
C  -4.183473 1.599888 0.103027
H  2.055367 -1.231603 -0.340446
H  2.320517 1.675621 -1.168398
H  1.919566 0.320831 -2.215937
H  2.219847 -0.492835 1.986887
H  2.489594 1.165209 1.469846
H  4.351372 0.877473 -2.285345
H  4.079602 -0.757064 -1.71749
H  4.272438 -1.237192 0.861631
H  4.647717 0.096991 1.933069
H  5.763044 0.354725 -0.290956
H  4.658869 1.677075 0.033948
H  -2.606773 -2.941013 -0.174188
H  -3.361256 -1.926113 1.068445
H  -1.846685 -2.736722 1.407728
H  -4.851213 -0.075981 -1.679156
H  -5.140672 -1.111546 -0.277497
H  -3.754925 -1.393343 -1.344401
H  -5.241236 1.451209 0.315689
H  -4.094347 2.229011 -0.785719
H  -3.738141 2.122805 0.944343
elementType: O N C H
totalener: -838.94903183 hartree
nucrepener: 1441.53636828 hartree
electener: -2280.48540012 hartree
oneelecener: -4003.23268778 hartree
twoeener: 1722.74728767 hartree
cpcmener: -0.03381945 hartree
kineticenergy: 835.24000943 hartree
xcener: -81.022632962915 hartree
chargesum: -0.0000000
charge: -0.489657 -0.493941 -0.136546 -0.122853 -0.417968 -0.155838 0.115896 -0.183743 -0.176987 -0.150222 -0.149222 -0.123610 0.381087 0.324762 0.370599 -0.182563 -0.174298 -0.173825 0.092221 0.092388 0.082652 0.082432 0.089325 0.076511 0.071579 0.071382 0.075381 0.077983 0.063557 0.125258 0.125011 0.122776 0.119875 0.118825 0.118688 0.112882 0.112634 0.107569
qa: -0.4897 -0.4939 -0.1365 -0.1229 -0.4180 -0.1558 0.1159 -0.1837 -0.1770 -0.1502 -0.1492 -0.1236 0.3811 0.3248 0.3706 -0.1826 -0.1743 -0.1738 0.0922 0.0924 0.0827 0.0824 0.0893 0.0765 0.0716 0.0714 0.0754 0.0780 0.0636 0.1253 0.1250 0.1228 0.1199 0.1188 0.1187 0.1129 0.1126 0.1076
va: 2.0301 1.9984 3.1783 3.2613 2.9269 3.1678 3.6534 3.9004 3.9034 3.9107 3.9085 3.8792 4.2927 4.4888 4.1097 3.8812 3.8852 3.8989 1.0467 1.0278 1.0165 1.0157 1.0307 1.0119 1.0087 1.0084 1.0125 1.0093 1.0108 0.9860 0.9939 1.0062 0.9930 0.9853 0.9920 0.9907 0.9945 1.0094
dispcorr: -0.017636873 hartree
energy: -838.966668706882
dipole: 3.94510 -6.79534 -2.85025 -2.17902 0.53178 -1.64724 -2.05407 1.67345 -0.38062
magnitude: 3.31394 au
magnitude: 8.42336 debye
