program: Orca
programVersion: 4.2.1
elementType: F F F O N N C C C C C C C C C C H H H H H H H H H H H
charge: 0
multiplicity: 1
keywords: wb97x-d3
keywords: def2-TZVPP
keywords: def2/J RIJCOSX GRIDX6 NOFINALGRIDX
keywords: grid4 nofinalgrid
keywords: scfconv7
keywords: smallprint printgap noloewdin
keywords: NOSOSCF
formula: C10H11F3N2O
InChI: InChI=1/C10H11F3N2O/c1-15(2)9(16)14-8-5-3-4-7(6-8)10(11,12)13/h3-6,14H,1-2H3
27 atoms
F  -3.400363 -0.956064 -1.093572
F  -2.515578 -1.708867 0.713977
F  -3.952471 -0.112989 0.802934
O  1.865554 -1.570241 0.414216
N  1.887626 0.64322 -0.130324
N  3.852357 -0.532291 0.046545
C  0.52811 0.934733 -0.158441
C  -1.81956 0.421284 -0.03631
C  -0.495815 0.002911 0.018465
C  0.185928 2.270341 -0.391867
C  -2.158328 1.746396 -0.270654
C  2.502184 -0.557278 0.130171
C  -1.136308 2.66632 -0.447451
C  -2.915237 -0.589125 0.103214
C  4.625294 -1.717353 0.355088
C  4.603193 0.657238 -0.308523
H  -0.258464 -1.03159 0.197691
H  2.475279 1.441588 -0.309742
H  0.968177 3.00703 -0.531003
H  -3.188994 2.070495 -0.315614
H  -1.371698 3.705879 -0.629629
H  3.977806 -2.537328 0.64502
H  5.314281 -1.521096 1.177858
H  5.208812 -2.033859 -0.510615
H  4.313769 1.054093 -1.283087
H  5.655964 0.39791 -0.374874
H  4.513428 1.447833 0.439986
elementType: F O N C H
totalener: -872.10366923 hartree
nucrepener: 1123.36820587 hartree
electener: -1995.47187510 hartree
oneelecener: -3426.94983367 hartree
twoeener: 1431.47795857 hartree
cpcmener: -0.03268989 hartree
kineticenergy: 868.76235093 hartree
xcener: -78.254047409699 hartree
chargesum: -0.0000000
charge: -0.184883 -0.183145 -0.185123 -0.595200 -0.174300 -0.151310 0.171255 -0.020401 -0.213270 -0.213307 -0.207650 0.445646 -0.124072 0.546910 -0.186196 -0.197200 0.158934 0.175500 0.138453 0.150525 0.163511 0.105254 0.115314 0.113774 0.118916 0.109278 0.122788
qa: -0.1849 -0.1831 -0.1851 -0.5952 -0.1743 -0.1513 0.1713 -0.0204 -0.2133 -0.2133 -0.2077 0.4456 -0.1241 0.5469 -0.1862 -0.1972 0.1589 0.1755 0.1385 0.1505 0.1635 0.1053 0.1153 0.1138 0.1189 0.1093 0.1228
va: 1.1018 1.1175 1.1126 1.9076 3.2387 3.1466 3.9193 3.7307 3.9841 3.9583 4.0016 4.2291 3.9186 4.4266 3.8822 3.8882 1.0623 1.0076 1.0070 1.0076 0.9883 1.0251 0.9849 0.9851 0.9898 0.9986 0.9868
dispcorr: -0.009637163 hartree
energy: -872.113306390346
dipole: 35.17996 -32.07240 3.10755 8.18785 -5.50991 2.67794 -1.78507 1.14567 -0.63940
magnitude: 4.15176 au
magnitude: 10.55293 debye
