program: Orca
programVersion: 4.2.1
elementType: F F F O N N C C C C C C C C C C H H H H H H H H H H H
charge: 0
multiplicity: 1
keywords: wb97x-d3
keywords: def2-TZVPP
keywords: def2/J RIJCOSX GRIDX6 NOFINALGRIDX
keywords: grid4 nofinalgrid
keywords: scfconv7
keywords: smallprint printgap noloewdin
keywords: NOSOSCF
formula: C10H11F3N2O
InChI: InChI=1/C10H11F3N2O/c1-15(2)9(16)14-8-5-3-4-7(6-8)10(11,12)13/h3-6,14H,1-2H3
27 atoms
F  -4.117758 -0.072096 -0.187688
F  -2.693551 -1.295113 -1.235331
F  -2.906682 -1.48181 0.893185
O  1.825932 -1.576361 -0.301243
N  1.879866 0.660812 0.124273
N  3.831256 -0.525007 -0.149673
C  0.522155 0.951566 0.199053
C  -1.830559 0.446586 0.09085
C  -0.505402 0.032304 -0.004167
C  0.182528 2.277267 0.496473
C  -2.165581 1.757063 0.387626
C  2.477164 -0.553394 -0.121658
C  -1.137493 2.668735 0.588177
C  -2.889833 -0.592357 -0.111158
C  4.576805 -1.742306 -0.384736
C  4.603065 0.68362 0.052096
H  -0.272174 -0.993884 -0.236709
H  2.47483 1.458131 0.283233
H  0.965367 3.009442 0.657356
H  -3.193392 2.081697 0.464245
H  -1.370604 3.699533 0.818922
H  3.905612 -2.584094 -0.516291
H  5.235175 -1.960655 0.458383
H  5.190079 -1.652246 -1.283443
H  4.464141 1.107677 1.04978
H  4.380897 1.449615 -0.694686
H  5.658955 0.445503 -0.045792
elementType: F O N C H
totalener: -872.11025825 hartree
nucrepener: 1124.84099993 hartree
electener: -1996.95125818 hartree
oneelecener: -3429.82422935 hartree
twoeener: 1432.87297117 hartree
cpcmener: -0.02641304 hartree
kineticenergy: 868.76442210 hartree
xcener: -78.253243197529 hartree
chargesum: -0.0000000
charge: -0.182735 -0.185205 -0.184173 -0.561339 -0.179469 -0.154615 0.174311 -0.024451 -0.226791 -0.219526 -0.189231 0.435857 -0.117309 0.553404 -0.188038 -0.198511 0.154206 0.169456 0.134762 0.152242 0.159376 0.108082 0.112849 0.112161 0.119117 0.118156 0.107413
qa: -0.1827 -0.1852 -0.1842 -0.5613 -0.1795 -0.1546 0.1743 -0.0245 -0.2268 -0.2195 -0.1892 0.4359 -0.1173 0.5534 -0.1880 -0.1985 0.1542 0.1695 0.1348 0.1522 0.1594 0.1081 0.1128 0.1122 0.1191 0.1182 0.1074
va: 1.1200 1.1122 1.1073 1.9488 3.2354 3.1358 3.9169 3.7424 4.0316 3.9642 3.9598 4.2393 3.9291 4.4304 3.8810 3.8905 1.0672 1.0116 1.0076 1.0066 0.9903 1.0262 0.9850 0.9849 0.9875 0.9887 0.9996
dispcorr: -0.009638590 hartree
energy: -872.119896843467
dipole: 34.86103 -31.88870 2.97233 8.30709 -5.74846 2.55863 1.38080 -0.92387 0.45693
magnitude: 3.94843 au
magnitude: 10.03611 debye
