program: Orca
programVersion: 4.2.1
elementType: Cl Cl O N N C C C C C C C C C H H H H H H H H H H
charge: 0
multiplicity: 1
keywords: wb97x-d3
keywords: def2-TZVPP
keywords: def2/J RIJCOSX GRIDX6 NOFINALGRIDX
keywords: grid4 nofinalgrid
keywords: scfconv7
keywords: smallprint printgap noloewdin
keywords: NOSOSCF
formula: C9H10Cl2N2O
InChI: InChI=1/C9H10Cl2N2O/c1-13(2)9(14)12-6-3-4-7(10)8(11)5-6/h3-5,12H,1-2H3
24 atoms
Cl -2.6034 -1.89635 0.015839
Cl -4.036078 0.909409 -0.008825
O  2.347964 -1.586999 0.015649
N  4.051056 -0.085489 -0.001697
N  1.870593 0.641168 -0.005146
C  0.482333 0.615108 -0.00562
C  2.741854 -0.422712 0.003783
C  -0.296934 -0.541108 0.004002
C  -0.165749 1.855311 -0.016736
C  5.068984 -1.115533 0.012147
C  4.516668 1.288181 -0.022176
C  -1.680295 -0.44026 0.002965
C  -1.541905 1.940673 -0.017925
C  -2.317866 0.790915 -0.007865
H  2.258691 1.571497 -0.01069
H  0.153145 -1.518576 0.012433
H  0.414378 2.769508 -0.025163
H  4.619313 -2.101859 0.026454
H  5.702541 -1.017124 0.894678
H  5.701818 -1.042005 -0.873319
H  4.194489 1.822417 -0.918126
H  5.602851 1.28755 -0.025816
H  4.200811 1.847257 0.860673
H  -2.016024 2.912252 -0.026264
elementType: Cl O N C H
totalener: -1454.21088897 hartree
nucrepener: 1059.03314866 hartree
electener: -2513.24403763 hartree
oneelecener: -4100.30243642 hartree
twoeener: 1587.05839878 hartree
cpcmener: -0.03135579 hartree
kineticenergy: 1450.56939594 hartree
xcener: -93.824214924007 hartree
chargesum: -0.0000000
charge: -0.074509 -0.081681 -0.593169 -0.150353 -0.172392 0.198449 0.446986 -0.215903 -0.247878 -0.186263 -0.194627 0.079836 -0.094795 -0.008024 0.175800 0.147603 0.139698 0.105260 0.114926 0.115034 0.120700 0.109082 0.120643 0.145576
qa: -0.0745 -0.0817 -0.5932 -0.1504 -0.1724 0.1984 0.4470 -0.2159 -0.2479 -0.1863 -0.1946 0.0798 -0.0948 -0.0080 0.1758 0.1476 0.1397 0.1053 0.1149 0.1150 0.1207 0.1091 0.1206 0.1456
va: 1.2455 1.2365 1.9092 3.1505 3.2416 3.9149 4.2256 4.0079 3.9962 3.8810 3.8875 3.9684 3.9759 3.9176 1.0079 1.0580 1.0062 1.0255 0.9851 0.9850 0.9887 0.9983 0.9884 1.0032
dispcorr: -0.008994080 hartree
energy: -1454.219883054736
dipole: 37.96363 -34.98438 2.97925 7.38306 -4.51493 2.86813 -0.08182 0.05412 -0.02770
magnitude: 4.13556 au
magnitude: 10.51176 debye
