program: Orca
programVersion: 5.0.3
elementType: S N N N N N C C C C C C C C C C C H H H H H H H H H H H H H H H H H H H H H
charge: 0
multiplicity: 1
keywords: wb97x-d3
keywords: def2-TZVPP
keywords: def2/J RIJCOSX
keywords: DEFGRID2
keywords: scfconv7
keywords: smallprint printgap noloewdin
keywords: NOSOSCF
formula: C11H21N5S
InChI: InChI=1/C11H21N5S/c1-6-12-9-14-10(13-8(4)7(2)3)16-11(15-9)17-5/h7-8,12-13H,6H2,1-5H3
38 atoms
S  -1.256136 2.718881 -0.043477
N  1.809359 -1.017761 -0.696036
N  -0.391983 -1.561076 -0.490858
N  0.310797 0.699715 -0.369708
N  -2.616224 -2.036168 -0.355417
N  -1.985917 0.169375 -0.195292
C  3.442763 -0.021669 0.875775
C  2.990992 -0.179058 -0.588602
C  3.967628 -1.319591 1.478017
C  4.466244 1.097964 1.020696
C  4.065588 -0.740884 -1.50732
C  0.547706 -0.61331 -0.506739
C  -1.639131 -1.121554 -0.339349
C  -0.967527 1.001864 -0.219874
C  -4.001455 -1.773493 -0.027034
C  -4.282916 -1.747766 1.464556
C  -3.047164 2.820585 0.117057
H  2.552495 0.275541 1.4402
H  2.716247 0.811056 -0.954413
H  4.908562 -1.627216 1.018109
H  4.156162 -1.19627 2.545641
H  3.259156 -2.143043 1.369904
H  4.694341 1.27849 2.072239
H  5.407951 0.858907 0.5229
H  4.096455 2.034995 0.599628
H  4.304623 -1.778999 -1.269337
H  3.740702 -0.704688 -2.547087
H  4.986281 -0.16374 -1.431396
H  1.952251 -2.016537 -0.711147
H  -2.316357 -2.99847 -0.359592
H  -4.303302 -0.8345 -0.484975
H  -4.594878 -2.553748 -0.500955
H  -5.343383 -1.566997 1.643431
H  -4.02347 -2.697967 1.931196
H  -3.720373 -0.959415 1.963402
H  -3.403589 2.293112 0.998032
H  -3.552529 2.445853 -0.769319
H  -3.278737 3.878905 0.228029
elementType: S N C H
totalener: -1103.92227133 hartree
nucrepener: 1380.58954552 hartree
electener: -2484.51181685 hartree
oneelecener: -4250.05222277 hartree
twoeener: 1765.54040592 hartree
cpcmener: -0.02360846 hartree
kineticenergy: 1100.01996395 hartree
xcener: -89.134173386322 hartree
chargesum: 0.0000000
charge: -0.052260 -0.215712 -0.462030 -0.433926 -0.211162 -0.447809 0.038654 0.168794 -0.313404 -0.304708 -0.316891 0.394694 0.376038 0.203993 0.014395 -0.261394 -0.250420 0.041277 0.069926 0.085052 0.098445 0.088812 0.095367 0.084165 0.092587 0.094839 0.101658 0.096092 0.161508 0.168941 0.080172 0.097966 0.089112 0.085833 0.080693 0.113409 0.114920 0.132374
qa: -0.0523 -0.2157 -0.4620 -0.4339 -0.2112 -0.4478 0.0387 0.1688 -0.3134 -0.3047 -0.3169 0.3947 0.3760 0.2040 0.0144 -0.2614 -0.2504 0.0413 0.0699 0.0851 0.0984 0.0888 0.0954 0.0842 0.0926 0.0948 0.1017 0.0961 0.1615 0.1689 0.0802 0.0980 0.0891 0.0858 0.0807 0.1134 0.1149 0.1324
va: 2.4025 3.1969 2.9815 2.9193 3.1920 2.9265 3.8353 3.7537 3.9462 3.9377 3.9659 4.2201 4.2521 4.3160 3.8613 3.9230 3.9710 1.0255 1.0372 0.9972 1.0034 1.0092 1.0030 1.0015 1.0035 0.9946 1.0085 1.0003 1.0273 1.0205 1.0141 0.9977 1.0081 1.0052 1.0082 1.0068 1.0074 1.0022
dispcorr: -0.015775872 hartree
energy: -1103.938047206052
dipole: 11.62726 -12.18605 -0.55879 -6.70661 5.40797 -1.29864 7.02171 -6.76009 0.26162
magnitude: 1.43776 au
magnitude: 3.65450 debye
