program: Orca
programVersion: 5.0.3
elementType: S N N N N N C C C C C C C C C C C H H H H H H H H H H H H H H H H H H H H H
charge: 0
multiplicity: 1
keywords: wb97x-d3
keywords: def2-TZVPP
keywords: def2/J RIJCOSX
keywords: DEFGRID2
keywords: scfconv7
keywords: smallprint printgap noloewdin
keywords: NOSOSCF
formula: C11H21N5S
InChI: InChI=1/C11H21N5S/c1-6-12-9-14-10(13-8(4)7(2)3)16-11(15-9)17-5/h7-8,12-13H,6H2,1-5H3
38 atoms
S  -1.224062 2.746896 -0.615945
N  1.881023 -1.017104 -0.498985
N  -0.311436 -1.523359 -0.175311
N  0.362661 0.718556 -0.543105
N  -2.5286 -1.98423 0.069337
N  -1.925443 0.213956 -0.229339
C  3.816609 -0.103208 0.752351
C  3.072364 -0.192638 -0.592474
C  2.963381 0.565005 1.8230
C  4.332763 -1.450794 1.244646
C  3.960002 -0.703924 -1.719042
C  0.617863 -0.589987 -0.395668
C  -1.562922 -1.0754 -0.109296
C  -0.916833 1.032326 -0.441402
C  -3.917342 -1.67458 0.334829
C  -4.198629 -1.303005 1.780364
C  -3.011632 2.86931 -0.433441
H  4.683223 0.540827 0.566715
H  2.742483 0.813252 -0.849797
H  2.086667 -0.034931 2.07674
H  3.537117 0.700793 2.741397
H  2.615398 1.549388 1.506293
H  4.885698 -1.326658 2.177054
H  3.517467 -2.149279 1.447611
H  5.008514 -1.924387 0.531641
H  4.885867 -0.129701 -1.765845
H  4.22643 -1.753814 -1.587505
H  3.458808 -0.60717 -2.682295
H  2.019151 -2.005101 -0.346821
H  -2.218746 -2.925359 0.253493
H  -4.237533 -0.875133 -0.330703
H  -4.496218 -2.555839 0.060943
H  -3.645523 -0.41264 2.079706
H  -5.261111 -1.096491 1.914324
H  -3.929154 -2.114568 2.457125
H  -3.342848 2.520913 0.541362
H  -3.535505 2.329604 -1.218169
H  -3.249542 3.928346 -0.522346
elementType: S N C H
totalener: -1103.92191295 hartree
nucrepener: 1390.53571976 hartree
electener: -2494.45763271 hartree
oneelecener: -4269.99581272 hartree
twoeener: 1775.53818000 hartree
cpcmener: -0.02353211 hartree
kineticenergy: 1100.01708982 hartree
xcener: -89.134255309777 hartree
chargesum: -0.0000000
charge: -0.053324 -0.210953 -0.459828 -0.421810 -0.210654 -0.449083 0.059860 0.145990 -0.309424 -0.312228 -0.309457 0.377183 0.375828 0.211164 0.013609 -0.260751 -0.248664 0.035944 0.081945 0.080770 0.099241 0.087832 0.094010 0.081715 0.094773 0.093313 0.091848 0.098729 0.161356 0.169247 0.080031 0.097692 0.080624 0.089232 0.085188 0.112756 0.114493 0.131804
qa: -0.0533 -0.2110 -0.4598 -0.4218 -0.2107 -0.4491 0.0599 0.1460 -0.3094 -0.3122 -0.3095 0.3772 0.3758 0.2112 0.0136 -0.2608 -0.2487 0.0359 0.0819 0.0808 0.0992 0.0878 0.0940 0.0817 0.0948 0.0933 0.0918 0.0987 0.1614 0.1692 0.0800 0.0977 0.0806 0.0892 0.0852 0.1128 0.1145 0.1318
va: 2.4009 3.2022 2.9734 2.9297 3.1898 2.9284 3.8212 3.7649 3.9352 3.9475 3.9762 4.2414 4.2527 4.3008 3.8609 3.9199 3.9723 1.0189 1.0387 1.0051 1.0065 1.0103 1.0052 1.0057 1.0007 1.0031 0.9971 1.0074 1.0276 1.0205 1.0137 0.9979 1.0088 1.0079 1.0054 1.0066 1.0075 1.0024
dispcorr: -0.016277266 hartree
energy: -1103.938190220453
dipole: 9.38640 -9.83160 -0.44520 -7.05462 5.82197 -1.23265 8.73041 -8.25545 0.47496
magnitude: 1.39399 au
magnitude: 3.54324 debye
