program: Orca
programVersion: 5.0.3
elementType: S N N N N N C C C C C C C C C C C H H H H H H H H H H H H H H H H H H H H H
charge: 0
multiplicity: 1
keywords: wb97x-d3
keywords: def2-TZVPP
keywords: def2/J RIJCOSX
keywords: DEFGRID2
keywords: scfconv7
keywords: smallprint printgap noloewdin
keywords: NOSOSCF
formula: C11H21N5S
InChI: InChI=1/C11H21N5S/c1-6-12-9-14-10(13-8(4)7(2)3)16-11(15-9)17-5/h7-8,12-13H,6H2,1-5H3
38 atoms
S  -1.720734 2.5079 -0.232206
N  1.695782 -1.085768 -0.220313
N  -0.471789 -1.685168 0.120715
N  0.110238 0.585496 -0.227753
N  -2.654156 -2.219568 0.498228
N  -2.148658 -0.010795 0.124967
C  3.790639 -0.163208 0.67815
C  2.829454 -0.229452 -0.520922
C  5.014962 0.692076 0.365246
C  3.088107 0.366707 1.923303
C  3.498099 -0.72328 -1.798961
C  0.415828 -0.719306 -0.110252
C  -1.737243 -1.281948 0.237751
C  -1.171641 0.849712 -0.100255
C  -4.076561 -1.98738 0.614626
C  -4.815703 -2.05736 -0.711586
C  -0.188714 3.409711 -0.524874
H  4.134764 -1.18498 0.8850
H  2.434386 0.772456 -0.696743
H  4.726797 1.696813 0.044976
H  5.642242 0.80052 1.251741
H  5.640043 0.260141 -0.416269
H  2.252321 -0.262373 2.229453
H  3.780334 0.410549 2.766141
H  2.704639 1.377366 1.761712
H  4.273029 -0.03708 -2.138032
H  3.960483 -1.702912 -1.654329
H  2.767287 -0.810902 -2.603682
H  1.875262 -2.075074 -0.127547
H  -2.322462 -3.170735 0.522079
H  -4.470263 -2.739896 1.298824
H  -4.239201 -1.018814 1.085495
H  -4.68557 -3.030842 -1.187274
H  -5.884703 -1.903821 -0.556289
H  -4.46569 -1.290668 -1.403946
H  0.497459 3.323635 0.315353
H  -0.470706 4.456352 -0.63846
H  0.303548 3.080851 -1.437552
elementType: S N C H
totalener: -1103.93307605 hartree
nucrepener: 1384.75923448 hartree
electener: -2488.69231053 hartree
oneelecener: -4258.26911494 hartree
twoeener: 1769.57680442 hartree
cpcmener: -0.02067573 hartree
kineticenergy: 1100.00252149 hartree
xcener: -89.130598206896 hartree
chargesum: 0.0000000
charge: -0.049305 -0.189778 -0.458860 -0.437824 -0.206251 -0.428662 0.061657 0.097975 -0.309278 -0.297559 -0.300715 0.377204 0.395207 0.200947 0.011353 -0.257635 -0.254574 0.037253 0.077227 0.088564 0.090487 0.095484 0.090146 0.096669 0.080538 0.092257 0.093644 0.098337 0.153775 0.165751 0.095218 0.080064 0.081239 0.087480 0.082071 0.112215 0.133763 0.113918
qa: -0.0493 -0.1898 -0.4589 -0.4378 -0.2063 -0.4287 0.0617 0.0980 -0.3093 -0.2976 -0.3007 0.3772 0.3952 0.2009 0.0114 -0.2576 -0.2546 0.0373 0.0772 0.0886 0.0905 0.0955 0.0901 0.0967 0.0805 0.0923 0.0936 0.0983 0.1538 0.1658 0.0952 0.0801 0.0812 0.0875 0.0821 0.1122 0.1338 0.1139
va: 2.4003 3.1852 2.9808 2.9290 3.1886 2.9279 3.8062 3.8072 3.9466 3.9312 3.9668 4.2413 4.2247 4.3217 3.8481 3.9216 3.9689 1.0236 1.0348 0.9996 1.0058 1.0005 1.0108 1.0061 1.0050 1.0001 1.0002 1.0086 1.0334 1.0233 0.9965 1.0227 1.0058 1.0082 1.0094 1.0067 1.0023 1.0069
dispcorr: -0.015946590 hartree
energy: -1103.949022638454
dipole: 17.75341 -16.58721 1.16620 -2.44346 1.53547 -0.90800 -0.38716 0.29387 -0.09329
magnitude: 1.48094 au
magnitude: 3.76425 debye
