program: Orca
programVersion: 5.0.3
elementType: S N N N N N C C C C C C C C C C C H H H H H H H H H H H H H H H H H H H H H
charge: 0
multiplicity: 1
keywords: wb97x-d3
keywords: def2-TZVPP
keywords: def2/J RIJCOSX
keywords: DEFGRID2
keywords: scfconv7
keywords: smallprint printgap noloewdin
keywords: NOSOSCF
formula: C11H21N5S
InChI: InChI=1/C11H21N5S/c1-6-12-9-14-10(13-8(4)7(2)3)16-11(15-9)17-5/h7-8,12-13H,6H2,1-5H3
38 atoms
S  -2.317727 2.702462 0.099641
N  1.856363 0.140321 0.651595
N  -0.011632 -1.030512 -0.012074
N  -0.08297 1.302389 0.400949
N  -1.914352 -2.099076 -0.654054
N  -2.044472 0.162567 -0.2565
C  3.763612 -0.963232 -0.482802
C  2.763624 -0.991069 0.687414
C  3.060924 -1.133936 -1.823969
C  4.636244 0.287287 -0.49136
C  3.447731 -1.049798 2.047617
C  0.557819 0.115627 0.336637
C  -1.315721 -0.959068 -0.295439
C  -1.356157 1.23909 0.087751
C  -3.322499 -2.26472 -0.934025
C  -4.092093 -2.86538 0.230832
C  -1.114404 3.959929 0.567656
H  4.416787 -1.830745 -0.33579
H  2.152913 -1.887488 0.575919
H  3.788781 -1.222443 -2.632712
H  2.438373 -2.030353 -1.844953
H  2.423246 -0.279437 -2.058911
H  4.042572 1.192359 -0.640898
H  5.203856 0.408512 0.432516
H  5.35992 0.243297 -1.307172
H  3.979844 -0.126153 2.282331
H  2.719027 -1.221519 2.840538
H  4.171891 -1.865162 2.07765
H  2.220768 1.042599 0.918793
H  -1.337486 -2.925573 -0.631505
H  -3.737336 -1.295659 -1.202361
H  -3.419705 -2.904974 -1.812583
H  -5.136808 -3.01681 -0.04438
H  -3.68207 -3.834645 0.519538
H  -4.066329 -2.212057 1.103787
H  -0.299731 4.022091 -0.150003
H  -0.714931 3.784359 1.563631
H  -1.651139 4.907946 0.568478
elementType: S N C H
totalener: -1103.93351952 hartree
nucrepener: 1381.31314666 hartree
electener: -2485.24666618 hartree
oneelecener: -4251.36672978 hartree
twoeener: 1766.12006360 hartree
cpcmener: -0.02051056 hartree
kineticenergy: 1100.01295312 hartree
xcener: -89.133429816501 hartree
chargesum: -0.0000000
charge: -0.049960 -0.212506 -0.460808 -0.450918 -0.203526 -0.426062 0.062156 0.130030 -0.308768 -0.313957 -0.304710 0.383651 0.386759 0.220478 0.000950 -0.251294 -0.251940 0.035511 0.081402 0.098352 0.089861 0.080795 0.081564 0.094226 0.094525 0.089782 0.101514 0.091665 0.160444 0.166587 0.086536 0.092357 0.086754 0.081769 0.082388 0.112811 0.113657 0.127928
qa: -0.0500 -0.2125 -0.4608 -0.4509 -0.2035 -0.4261 0.0622 0.1300 -0.3088 -0.3140 -0.3047 0.3837 0.3868 0.2205 0.0010 -0.2513 -0.2519 0.0355 0.0814 0.0984 0.0899 0.0808 0.0816 0.0942 0.0945 0.0898 0.1015 0.0917 0.1604 0.1666 0.0865 0.0924 0.0868 0.0818 0.0824 0.1128 0.1137 0.1279
va: 2.4022 3.2054 2.9403 2.9568 3.1947 2.9427 3.8210 3.7885 3.9357 3.9431 3.9769 4.2259 4.2282 4.2930 3.8481 3.9344 3.9691 1.0179 1.0368 1.0064 1.0082 1.0055 1.0077 1.0008 1.0057 0.9984 1.0057 1.0037 1.0273 1.0211 1.0277 0.9964 1.0088 1.0041 1.0053 1.0099 1.0094 1.0028
dispcorr: -0.015586190 hartree
energy: -1103.949105706993
dipole: 17.88649 -16.56563 1.32086 -10.34687 9.52449 -0.82238 -0.13346 0.37391 0.24046
magnitude: 1.57442 au
magnitude: 4.00186 debye
