program: Orca
programVersion: 5.0.3
elementType: S N N N N N C C C C C C C C C C C H H H H H H H H H H H H H H H H H H H H H
charge: 0
multiplicity: 1
keywords: wb97x-d3
keywords: def2-TZVPP
keywords: def2/J RIJCOSX
keywords: DEFGRID2
keywords: scfconv7
keywords: smallprint printgap noloewdin
keywords: NOSOSCF
formula: C11H21N5S
InChI: InChI=1/C11H21N5S/c1-6-12-9-14-10(13-8(4)7(2)3)16-11(15-9)17-5/h7-8,12-13H,6H2,1-5H3
38 atoms
S  -1.695339 2.608288 -0.263384
N  1.75957 -0.949713 -0.444028
N  -0.411708 -1.588818 -0.247023
N  0.156597 0.707319 -0.388409
N  -2.602211 -2.176745 -0.048815
N  -2.102411 0.065495 -0.129606
C  3.70332 0.080729 0.703555
C  2.903202 -0.070764 -0.603173
C  2.894376 0.793559 1.779928
C  4.242732 -1.242812 1.233981
C  3.759749 -0.568651 -1.760744
C  0.472799 -0.599457 -0.357057
C  -1.684487 -1.207997 -0.139238
C  -1.130392 0.949846 -0.26826
C  -4.016348 -1.971307 0.167995
C  -4.400297 -1.92596 1.638075
C  -0.172541 3.547989 -0.47022
H  4.559591 0.718376 0.455501
H  2.514324 0.913611 -0.866484
H  3.509177 0.982197 2.662108
H  2.517643 1.757328 1.432762
H  2.039212 0.198438 2.106043
H  4.875487 -1.759072 0.510281
H  4.849579 -1.076998 2.12605
H  3.435959 -1.922467 1.519134
H  4.639993 0.062688 -1.887285
H  4.106306 -1.592292 -1.60658
H  3.196489 -0.54784 -2.69431
H  1.935979 -1.943254 -0.422665
H  -2.245671 -3.118014 0.001526
H  -4.317078 -1.050081 -0.328062
H  -4.544048 -2.78495 -0.331488
H  -3.911343 -1.098157 2.153731
H  -5.478123 -1.795371 1.744923
H  -4.12579 -2.852352 2.145237
H  -0.463876 4.597734 -0.479254
H  0.319188 3.316377 -1.41204
H  0.516151 3.384768 0.355532
elementType: S N C H
totalener: -1103.93314785 hartree
nucrepener: 1392.27374282 hartree
electener: -2496.20689067 hartree
oneelecener: -4273.27919159 hartree
twoeener: 1777.07230092 hartree
cpcmener: -0.02063704 hartree
kineticenergy: 1100.00996339 hartree
xcener: -89.132964231060 hartree
chargesum: 0.0000000
charge: -0.049449 -0.211034 -0.460000 -0.441677 -0.205785 -0.427601 0.067232 0.132634 -0.307339 -0.314795 -0.304971 0.379031 0.392903 0.204214 0.010836 -0.257129 -0.253123 0.034151 0.083696 0.098548 0.086924 0.080018 0.093858 0.093965 0.081465 0.091455 0.091152 0.101321 0.158617 0.165171 0.081658 0.094105 0.082375 0.087081 0.082172 0.133375 0.114603 0.110344
qa: -0.0494 -0.2110 -0.4600 -0.4417 -0.2058 -0.4276 0.0672 0.1326 -0.3073 -0.3148 -0.3050 0.3790 0.3929 0.2042 0.0108 -0.2571 -0.2531 0.0342 0.0837 0.0985 0.0869 0.0800 0.0939 0.0940 0.0815 0.0915 0.0912 0.1013 0.1586 0.1652 0.0817 0.0941 0.0824 0.0871 0.0822 0.1334 0.1146 0.1103
va: 2.3993 3.2022 2.9806 2.9318 3.1895 2.9310 3.8092 3.8013 3.9449 3.9434 3.9741 4.2393 4.2290 4.3186 3.8480 3.9270 3.9717 1.0182 1.0237 1.0071 1.0057 1.0054 1.0009 1.0058 1.0074 1.0039 0.9981 1.0061 1.0293 1.0235 1.0240 0.9967 1.0078 1.0087 1.0052 1.0031 1.0068 1.0060
dispcorr: -0.016357515 hartree
energy: -1103.949505366108
dipole: 17.01932 -15.81787 1.20145 -5.06225 4.23509 -0.82715 6.40961 -6.43808 -0.02846
magnitude: 1.45893 au
magnitude: 3.70831 debye
