program: Orca
programVersion: 5.0.3
elementType: S N N N N N C C C C C C C C C C C H H H H H H H H H H H H H H H H H H H H H
charge: 0
multiplicity: 1
keywords: wb97x-d3
keywords: def2-TZVPP
keywords: def2/J RIJCOSX
keywords: DEFGRID2
keywords: scfconv7
keywords: smallprint printgap noloewdin
keywords: NOSOSCF
formula: C11H21N5S
InChI: InChI=1/C11H21N5S/c1-6-12-9-14-10(13-8(4)7(2)3)16-11(15-9)17-5/h7-8,12-13H,6H2,1-5H3
38 atoms
S  -2.462997 2.69206 -0.200203
N  1.892761 0.47072 0.384149
N  0.021678 -0.870233 0.438575
N  -0.131336 1.474172 0.130803
N  -1.886171 -2.107914 0.479716
N  -2.094077 0.159483 0.14918
C  3.710717 -0.760373 -0.720124
C  2.86655 -0.590454 0.554939
C  4.743551 -1.870898 -0.556146
C  2.833654 -1.040232 -1.935889
C  3.702063 -0.305709 1.797777
C  0.565778 0.334908 0.323748
C  -1.311004 -0.907628 0.352297
C  -1.429753 1.300192 0.053303
C  -3.293284 -2.397626 0.318149
C  -3.634593 -2.941592 -1.059613
C  -1.282347 4.052602 -0.228012
H  4.247722 0.18148 -0.8923
H  2.30515 -1.512381 0.715518
H  5.283093 -2.033796 -1.490695
H  5.488625 -1.643298 0.206159
H  4.266862 -2.816809 -0.285411
H  2.243304 -1.949497 -1.798281
H  2.144284 -0.223273 -2.149417
H  3.446538 -1.181345 -2.828024
H  4.359068 -1.140027 2.039732
H  4.325055 0.582401 1.66546
H  3.057634 -0.138855 2.66156
H  2.240417 1.413266 0.285015
H  -1.255069 -2.888229 0.575665
H  -3.574294 -3.124475 1.082878
H  -3.861106 -1.491447 0.521795
H  -3.086548 -3.861913 -1.270683
H  -4.699765 -3.170077 -1.122208
H  -3.401009 -2.219771 -1.843851
H  -1.866868 4.958977 -0.381365
H  -0.57144 3.954429 -1.045045
H  -0.747496 4.140359 0.71519
elementType: S N C H
totalener: -1103.93313110 hartree
nucrepener: 1376.91222289 hartree
electener: -2480.84535399 hartree
oneelecener: -4242.55269154 hartree
twoeener: 1761.70733755 hartree
cpcmener: -0.02061069 hartree
kineticenergy: 1100.00823834 hartree
xcener: -89.131641235344 hartree
chargesum: -0.0000000
charge: -0.049669 -0.192871 -0.456992 -0.449423 -0.203760 -0.427803 0.061834 0.098105 -0.309137 -0.300491 -0.300478 0.380209 0.384597 0.221318 0.002796 -0.251676 -0.251014 0.037437 0.074467 0.090365 0.094884 0.088872 0.082732 0.090612 0.096351 0.093118 0.091937 0.097992 0.156913 0.166260 0.092078 0.085542 0.082233 0.086585 0.082747 0.127948 0.112170 0.113213
qa: -0.0497 -0.1929 -0.4570 -0.4494 -0.2038 -0.4278 0.0618 0.0981 -0.3091 -0.3005 -0.3005 0.3802 0.3846 0.2213 0.0028 -0.2517 -0.2510 0.0374 0.0745 0.0904 0.0949 0.0889 0.0827 0.0906 0.0964 0.0931 0.0919 0.0980 0.1569 0.1663 0.0921 0.0855 0.0822 0.0866 0.0827 0.1279 0.1122 0.1132
va: 2.4015 3.1845 2.9430 2.9519 3.1916 2.9417 3.8106 3.7896 3.9465 3.9269 3.9663 4.2287 4.2311 4.2929 3.8508 3.9333 3.9691 1.0233 1.0490 1.0058 1.0010 1.0000 1.0067 1.0109 1.0061 1.0002 1.0005 1.0089 1.0308 1.0213 0.9965 1.0266 1.0042 1.0088 1.0055 1.0029 1.0104 1.0096
dispcorr: -0.015362786 hartree
energy: -1103.948493885801
dipole: 19.10658 -17.68626 1.42032 -13.23348 12.57650 -0.65698 -4.17228 4.26571 0.09343
magnitude: 1.56769 au
magnitude: 3.98476 debye
