program: Orca
programVersion: 5.0.3
elementType: S N N N N N C C C C C C C C C C C H H H H H H H H H H H H H H H H H H H H H
charge: 0
multiplicity: 1
keywords: wb97x-d3
keywords: def2-TZVPP
keywords: def2/J RIJCOSX
keywords: DEFGRID2
keywords: scfconv7
keywords: smallprint printgap noloewdin
keywords: NOSOSCF
formula: C11H21N5S
InChI: InChI=1/C11H21N5S/c1-6-12-9-14-10(13-8(4)7(2)3)16-11(15-9)17-5/h7-8,12-13H,6H2,1-5H3
38 atoms
S  -2.47948 2.590823 -0.458367
N  1.878001 0.493669 0.496181
N  0.032153 -0.871308 0.540648
N  -0.144599 1.444604 0.061971
N  -1.869933 -2.123914 0.609237
N  -2.086106 0.1009 0.100369
C  3.147498 -1.370798 -0.520005
C  2.823795 -0.572388 0.757076
C  3.828305 -0.528661 -1.59233
C  3.960101 -2.622062 -0.204443
C  4.044346 0.025226 1.443503
C  0.552255 0.33445 0.363264
C  -1.295795 -0.928162 0.407575
C  -1.439036 1.24566 -0.053273
C  -3.276386 -2.392141 0.418062
C  -3.664827 -2.594394 -1.038619
C  -1.294571 3.945132 -0.567068
H  2.180846 -1.701323 -0.912397
H  2.339808 -1.261898 1.453581
H  4.833415 -0.221587 -1.295414
H  3.928857 -1.095685 -2.518571
H  3.256688 0.369734 -1.82963
H  4.972102 -2.384084 0.128542
H  3.485358 -3.22214 0.574149
H  4.05535 -3.252717 -1.089181
H  4.544211 0.768129 0.818449
H  3.759999 0.511006 2.376766
H  4.776534 -0.74382 1.683723
H  2.219068 1.422978 0.317026
H  -1.236103 -2.887516 0.767124
H  -3.51845 -3.280529 1.003755
H  -3.847622 -1.567286 0.84275
H  -3.113127 -3.421251 -1.487561
H  -4.729025 -2.817852 -1.122545
H  -3.464996 -1.692748 -1.615781
H  -1.869399 4.832201 -0.82822
H  -0.549973 3.75943 -1.336721
H  -0.794037 4.109416 0.384232
totalener: -1103.90852824 hartree
nucrepener: 1382.94007246 hartree
electener: -2486.84860070 hartree
oneelecener: -4254.00216905 hartree
twoeener: 1767.15356835 hartree
kineticenergy: 1100.05569459 hartree
xcener: -89.139081911892 hartree
chargesum: 0.0000000
charge: -0.014477 -0.225132 -0.436046 -0.422319 -0.219123 -0.391181 0.048944 0.133983 -0.302298 -0.286719 -0.309583 0.388521 0.387795 0.220923 0.004925 -0.240243 -0.264118 0.052320 0.071467 0.073875 0.091432 0.087143 0.073933 0.090061 0.088797 0.080043 0.109065 0.088418 0.139054 0.139460 0.079056 0.084811 0.066721 0.077246 0.096952 0.113323 0.110765 0.112208
qa: -0.0145 -0.2251 -0.4360 -0.4223 -0.2191 -0.3912 0.0489 0.1340 -0.3023 -0.2867 -0.3096 0.3885 0.3878 0.2209 0.0049 -0.2402 -0.2641 0.0523 0.0715 0.0739 0.0914 0.0871 0.0739 0.0901 0.0888 0.0800 0.1091 0.0884 0.1391 0.1395 0.0791 0.0848 0.0667 0.0772 0.0970 0.1133 0.1108 0.1122
va: 2.4137 3.1864 2.9548 2.9801 3.1817 2.9496 3.7743 3.8310 3.9490 3.9463 3.9583 4.2062 4.2027 4.2750 3.8769 3.9002 3.9739 1.0305 1.0323 0.9999 1.0071 1.0141 1.0035 1.0049 1.0062 0.9976 1.0084 1.0040 1.0454 1.0411 0.9972 1.0211 1.0098 1.0112 1.0135 1.0063 1.0102 1.0093
dispcorr: -0.015556097 hartree
energy: -1103.924084341730
dipole: 19.98179 -19.07096 0.91082 -12.25199 11.74243 -0.50956 -3.42542 3.52620 0.10079
magnitude: 1.04852 au
magnitude: 2.66514 debye
