program: Orca
programVersion: 5.0.3
elementType: S N N N N N C C C C C C C C C C C H H H H H H H H H H H H H H H H H H H H H
charge: 0
multiplicity: 1
keywords: wb97x-d3
keywords: def2-TZVPP
keywords: def2/J RIJCOSX
keywords: DEFGRID2
keywords: scfconv7
keywords: smallprint printgap noloewdin
keywords: NOSOSCF
formula: C11H21N5S
InChI: InChI=1/C11H21N5S/c1-6-12-9-14-10(13-8(4)7(2)3)16-11(15-9)17-5/h7-8,12-13H,6H2,1-5H3
38 atoms
S  -2.415314 2.576106 -0.036824
N  1.907131 0.267573 0.469315
N  0.025806 -1.052848 0.341773
N  -0.100113 1.310973 0.234734
N  -1.902548 -2.260758 0.228138
N  -2.073028 0.020956 0.089388
C  3.670421 -1.138653 -0.564827
C  2.83815 -0.81906 0.690186
C  2.78022 -1.597979 -1.713973
C  4.558933 0.019938 -1.005951
C  3.696043 -0.516785 1.913715
C  0.574804 0.152594 0.344964
C  -1.303209 -1.060394 0.215505
C  -1.401025 1.160881 0.114258
C  -3.318012 -2.464206 0.025733
C  -3.734368 -2.448558 -1.438433
C  -1.200389 3.90527 0.050245
H  4.322021 -1.975482 -0.286491
H  2.230425 -1.698035 0.909173
H  2.127429 -2.418214 -1.415079
H  2.143117 -0.786815 -2.069367
H  3.381652 -1.936864 -2.558787
H  5.156065 -0.263552 -1.873416
H  3.964577 0.887396 -1.301186
H  5.255517 0.334627 -0.228152
H  4.422819 -1.311916 2.083307
H  4.252517 0.416337 1.807705
H  3.075918 -0.431742 2.805551
H  2.249185 1.213915 0.491112
H  -1.285421 -3.053335 0.252869
H  -3.576826 -3.420516 0.483021
H  -3.859872 -1.69362 0.572732
H  -3.215482 -3.219737 -2.009031
H  -4.806054 -2.627221 -1.53216
H  -3.514403 -1.481137 -1.887694
H  -0.483637 3.841261 -0.764016
H  -0.669088 3.893805 0.99821
H  -1.760085 4.834916 -0.036321
totalener: -1103.90825769 hartree
nucrepener: 1388.75266684 hartree
electener: -2492.66092453 hartree
oneelecener: -4265.66810410 hartree
twoeener: 1773.00717957 hartree
kineticenergy: 1100.05936231 hartree
xcener: -89.139862795554 hartree
chargesum: -0.0000000
charge: -0.014111 -0.227625 -0.426161 -0.421063 -0.219317 -0.390629 0.050213 0.112294 -0.272879 -0.301574 -0.286449 0.379779 0.396001 0.219066 0.003829 -0.240727 -0.264752 0.030728 0.081595 0.087121 0.078918 0.089416 0.089217 0.076561 0.086861 0.084497 0.074476 0.104273 0.138446 0.139848 0.080054 0.084636 0.067303 0.077144 0.096719 0.111833 0.111427 0.113033
qa: -0.0141 -0.2276 -0.4262 -0.4211 -0.2193 -0.3906 0.0502 0.1123 -0.2729 -0.3016 -0.2864 0.3798 0.3960 0.2191 0.0038 -0.2407 -0.2648 0.0307 0.0816 0.0871 0.0789 0.0894 0.0892 0.0766 0.0869 0.0845 0.0745 0.1043 0.1384 0.1398 0.0801 0.0846 0.0673 0.0771 0.0967 0.1118 0.1114 0.1130
va: 2.4147 3.1881 2.9629 2.9748 3.1838 2.9503 3.8260 3.8232 3.9421 3.9449 3.9800 4.2190 4.1901 4.2774 3.8752 3.9020 3.9747 1.0166 1.0385 1.0131 1.0095 1.0072 1.0097 1.0103 1.0022 1.0059 1.0014 1.0073 1.0450 1.0404 0.9967 1.0221 1.0096 1.0113 1.0128 1.0096 1.0098 1.0063
dispcorr: -0.015892504 hartree
energy: -1103.924150190536
dipole: 18.41236 -17.48865 0.92371 -9.52420 8.97986 -0.54435 -4.88766 4.99900 0.11134
magnitude: 1.07794 au
magnitude: 2.73990 debye
