program: Orca
programVersion: 5.0.3
elementType: S N N N N N C C C C C C C C C C C H H H H H H H H H H H H H H H H H H H H H
charge: 0
multiplicity: 1
keywords: wb97x-d3
keywords: def2-TZVPP
keywords: def2/J RIJCOSX
keywords: DEFGRID2
keywords: scfconv7
keywords: smallprint printgap noloewdin
keywords: NOSOSCF
formula: C11H21N5S
InChI: InChI=1/C11H21N5S/c1-6-12-9-14-10(13-8(4)7(2)3)16-11(15-9)17-5/h7-8,12-13H,6H2,1-5H3
38 atoms
S  -2.549493 2.56139 0.031115
N  1.857923 0.407427 0.486564
N  0.069876 -0.963127 0.013926
N  -0.184615 1.380597 0.264396
N  -1.769941 -2.219385 -0.467535
N  -2.067567 0.03848 -0.215362
C  3.812975 -0.620005 -0.606009
C  2.843293 -0.64805 0.588562
C  4.852101 -1.733475 -0.505389
C  3.062093 -0.72307 -1.92966
C  3.548153 -0.542245 1.938088
C  0.546701 0.251163 0.245952
C  -1.244677 -1.010996 -0.213128
C  -1.464386 1.190759 0.028948
C  -3.183185 -2.469643 -0.631224
C  -3.947335 -2.531951 0.683405
C  -1.429094 3.912194 0.442582
H  4.343621 0.341409 -0.584494
H  2.28853 -1.587816 0.552882
H  5.483457 -1.752076 -1.394345
H  5.512572 -1.617275 0.353216
H  4.371413 -2.711763 -0.427895
H  2.488257 -1.650126 -1.983754
H  2.366655 0.102526 -2.073246
H  3.758881 -0.71402 -2.768874
H  4.156591 0.3637 2.001282
H  2.818405 -0.514574 2.746584
H  4.205459 -1.391203 2.118133
H  2.146055 1.356285 0.661741
H  -1.135628 -2.994003 -0.382473
H  -3.602683 -1.690521 -1.266588
H  -3.283682 -3.410695 -1.174047
H  -5.002721 -2.738149 0.502036
H  -3.559916 -3.317535 1.333104
H  -3.876762 -1.582118 1.211138
H  -0.962828 3.756195 1.411771
H  -2.039068 4.813139 0.47906
H  -0.656759 4.032212 -0.312305
totalener: -1103.90791572 hartree
nucrepener: 1382.17715323 hartree
electener: -2486.08506895 hartree
oneelecener: -4252.52183032 hartree
twoeener: 1766.43676137 hartree
kineticenergy: 1100.05737480 hartree
xcener: -89.138565729213 hartree
chargesum: -0.0000000
charge: -0.014550 -0.203858 -0.419921 -0.422231 -0.219797 -0.391831 0.045706 0.082329 -0.286567 -0.260982 -0.282244 0.374955 0.392968 0.220476 0.005689 -0.240783 -0.264681 0.024079 0.069668 0.083818 0.086765 0.084125 0.082933 0.087546 0.085565 0.079643 0.102141 0.084395 0.134194 0.139601 0.084308 0.079113 0.076895 0.067311 0.097082 0.111402 0.113122 0.111618
qa: -0.0145 -0.2039 -0.4199 -0.4222 -0.2198 -0.3918 0.0457 0.0823 -0.2866 -0.2610 -0.2822 0.3750 0.3930 0.2205 0.0057 -0.2408 -0.2647 0.0241 0.0697 0.0838 0.0868 0.0841 0.0829 0.0875 0.0856 0.0796 0.1021 0.0844 0.1342 0.1396 0.0843 0.0791 0.0769 0.0673 0.0971 0.1114 0.1131 0.1116
va: 2.4143 3.1640 2.9660 2.9741 3.1816 2.9479 3.8494 3.8281 3.9474 3.9256 3.9654 4.2237 4.1930 4.2757 3.8773 3.9011 3.9750 1.0227 1.0504 1.0094 1.0044 1.0023 1.0100 1.0155 1.0072 1.0026 1.0097 1.0039 1.0478 1.0407 1.0210 0.9970 1.0112 1.0096 1.0136 1.0097 1.0062 1.0096
dispcorr: -0.015606013 hartree
energy: -1103.923521736318
dipole: 18.83055 -17.89057 0.93998 -11.49252 11.01176 -0.48076 0.65792 -0.44039 0.21752
magnitude: 1.07797 au
magnitude: 2.73998 debye
