program: Orca
programVersion: 5.0.3
elementType: S N N N N N C C C C C C C C C C C H H H H H H H H H H H H H H H H H H H H H
charge: 0
multiplicity: 1
keywords: wb97x-d3
keywords: def2-TZVPP
keywords: def2/J RIJCOSX
keywords: DEFGRID2
keywords: scfconv7
keywords: smallprint printgap noloewdin
keywords: NOSOSCF
formula: C11H21N5S
InChI: InChI=1/C11H21N5S/c1-6-12-9-14-10(13-8(4)7(2)3)16-11(15-9)17-5/h7-8,12-13H,6H2,1-5H3
38 atoms
S  -1.193806 2.65524 -0.338023
N  1.802388 -1.198249 -0.296068
N  -0.387303 -1.633504 0.136034
N  0.340443 0.580252 -0.290739
N  -2.590712 -2.000432 0.582403
N  -1.942721 0.156033 0.140173
C  3.913771 -0.364503 0.656778
C  2.985426 -0.408331 -0.569936
C  5.151619 0.487943 0.387747
C  3.178416 0.153796 1.888958
C  3.670775 -0.948134 -1.821502
C  0.553358 -0.731528 -0.146711
C  -1.610818 -1.135854 0.27285
C  -0.919813 0.940159 -0.135841
C  -3.988716 -1.651534 0.672782
C  -4.689726 -1.582693 -0.67666
C  -2.973452 2.774668 -0.078468
H  4.248206 -1.390888 0.860991
H  2.634695 0.605956 -0.769249
H  5.763796 0.570161 1.286457
H  5.785912 0.073787 -0.395183
H  4.87188 1.501468 0.090758
H  3.85179 0.203527 2.745804
H  2.783785 1.156773 1.716312
H  2.341916 -0.484846 2.16955
H  4.491157 -0.307119 -2.139767
H  4.080297 -1.947601 -1.65335
H  2.961638 -1.007994 -2.646341
H  1.904196 -2.191871 -0.167009
H  -2.320484 -2.96817 0.606224
H  -4.468862 -2.395504 1.310245
H  -4.074613 -0.694196 1.18508
H  -4.636239 -2.536239 -1.202967
H  -5.743169 -1.330825 -0.547926
H  -4.234455 -0.818987 -1.30594
H  -3.252384 2.448115 0.919932
H  -3.522048 2.190602 -0.812932
H  -3.227589 3.826848 -0.195518
totalener: -1103.90746207 hartree
nucrepener: 1385.85500943 hartree
electener: -2489.76247150 hartree
oneelecener: -4259.93129221 hartree
twoeener: 1770.16882071 hartree
kineticenergy: 1100.05397421 hartree
xcener: -89.138218808948 hartree
chargesum: 0.0000000
charge: -0.014965 -0.198115 -0.414619 -0.372124 -0.217389 -0.429692 0.044335 0.080842 -0.287274 -0.263904 -0.279118 0.373569 0.381738 0.207132 0.002475 -0.240200 -0.262838 0.024103 0.080604 0.082475 0.086388 0.087209 0.084266 0.091125 0.083790 0.084682 0.077456 0.100807 0.132111 0.138975 0.083120 0.079120 0.072416 0.077700 0.087913 0.110787 0.108894 0.116206
qa: -0.0150 -0.1981 -0.4146 -0.3721 -0.2174 -0.4297 0.0443 0.0808 -0.2873 -0.2639 -0.2791 0.3736 0.3817 0.2071 0.0025 -0.2402 -0.2628 0.0241 0.0806 0.0825 0.0864 0.0872 0.0843 0.0911 0.0838 0.0847 0.0775 0.1008 0.1321 0.1390 0.0831 0.0791 0.0724 0.0777 0.0879 0.1108 0.1089 0.1162
va: 2.4101 3.1657 2.9996 2.9593 3.1779 2.9412 3.8408 3.8194 3.9495 3.9259 3.9644 4.2276 4.2298 4.2869 3.8877 3.9034 3.9805 1.0219 1.0498 1.0091 1.0039 1.0025 1.0073 1.0094 1.0155 1.0042 1.0028 1.0107 1.0486 1.0425 0.9980 1.0169 1.0108 1.0107 1.0114 1.0074 1.0055 1.0069
dispcorr: -0.016076831 hartree
energy: -1103.923538900265
dipole: 9.89981 -10.26847 -0.36865 -4.68540 3.83930 -0.84610 1.04452 -0.91457 0.12995
magnitude: 0.93203 au
magnitude: 2.36903 debye
