program: Orca
programVersion: 4.2.1
elementType: O O O O N N C C C C C C C C C C C C C C C C H H H H H H H H H H H H H H H H
charge: 0
multiplicity: 1
keywords: wb97x-d3
keywords: def2-TZVPP
keywords: def2/J RIJCOSX GRIDX6 NOFINALGRIDX
keywords: grid4 nofinalgrid
keywords: scfconv7
keywords: smallprint printgap noloewdin
keywords: NOSOSCF
formula: C16H16N2O4
InChI: InChI=1/C16H16N2O4/c1-2-21-15(19)18-13-9-6-10-14(11-13)22-16(20)17-12-7-4-3-5-8-12/h3-11,17-18H,2H2,1H3
38 atoms
O  1.074428 1.746936 -0.547637
O  -4.744937 -1.366166 -0.069638
O  1.423748 0.27418 1.127642
O  -2.608043 -1.406607 -0.766988
N  -3.537382 0.451936 0.197814
N  2.941122 0.581978 -0.562148
C  -2.476245 1.355314 0.221741
C  -0.20282 2.026012 -0.091789
C  -1.181165 1.049155 -0.187732
C  -2.755711 2.638554 0.701391
C  -0.458767 3.296485 0.383341
C  -1.758679 3.592181 0.773444
C  3.952202 -0.338225 -0.261596
C  3.867518 -1.303391 0.740831
C  5.100301 -0.277333 -1.053647
C  1.79166 0.802227 0.106591
C  -3.543784 -0.826613 -0.258263
C  4.923058 -2.18553 0.931658
C  6.142816 -1.164742 -0.852169
C  6.06261 -2.128304 0.144486
C  -4.932294 -2.724058 -0.501637
C  -6.328906 -3.137842 -0.11626
H  -0.929618 0.07737 -0.580225
H  -3.761495 2.887736 1.016277
H  0.327407 4.036782 0.440648
H  -1.995461 4.580256 1.143611
H  -4.40973 0.795871 0.572949
H  3.095117 1.146399 -1.385696
H  2.996548 -1.385922 1.369745
H  5.174906 0.469187 -1.835532
H  4.84111 -2.931341 1.711434
H  7.021224 -1.099482 -1.480291
H  6.875739 -2.823431 0.303214
H  -4.193217 -3.369173 -0.023948
H  -4.792302 -2.787343 -1.582239
H  -6.494198 -4.164596 -0.441371
H  -7.083544 -2.512469 -0.593035
H  -6.475857 -3.102881 0.963181
elementType: O N C H
totalener: -1029.90747786 hartree
nucrepener: 1651.93043067 hartree
electener: -2681.83790853 hartree
oneelecener: -4683.69032936 hartree
twoeener: 2001.85242083 hartree
cpcmener: -0.04304067 hartree
kineticenergy: 1025.59122185 hartree
xcener: -97.686162216926 hartree
chargesum: -0.0000000
charge: -0.335323 -0.326943 -0.490525 -0.525115 -0.140382 -0.136088 0.174185 0.240758 -0.216053 -0.234847 -0.238366 -0.102931 0.200051 -0.245474 -0.228080 0.521013 0.544007 -0.141700 -0.119476 -0.202683 0.045908 -0.254901 0.156536 0.141680 0.155189 0.163886 0.168938 0.172842 0.159820 0.139850 0.161724 0.162729 0.162500 0.097155 0.100201 0.090897 0.089867 0.089148
qa: -0.3353 -0.3269 -0.4905 -0.5251 -0.1404 -0.1361 0.1742 0.2408 -0.2161 -0.2348 -0.2384 -0.1029 0.2001 -0.2455 -0.2281 0.5210 0.5440 -0.1417 -0.1195 -0.2027 0.0459 -0.2549 0.1565 0.1417 0.1552 0.1639 0.1689 0.1728 0.1598 0.1398 0.1617 0.1627 0.1625 0.0972 0.1002 0.0909 0.0899 0.0891
va: 2.0825 2.0844 2.0140 1.9773 3.2523 3.2643 3.8767 3.7921 3.9936 3.9296 4.0224 3.8949 3.7751 3.9397 3.9328 4.2364 4.2378 3.9061 3.8862 3.9112 3.8337 3.9736 1.0435 1.0076 0.9991 0.9868 1.0223 1.0203 1.0294 1.0088 0.9907 0.9887 0.9895 0.9969 0.9955 1.0063 1.0024 1.0026
dispcorr: -0.013838465 hartree
energy: -1029.921316322859
dipole: -9.40325 8.31023 -1.09302 -9.57326 10.41397 0.84071 -0.30990 -0.36316 -0.67305
magnitude: 1.53443 au
magnitude: 3.90021 debye
