program: Orca
programVersion: 4.2.1
elementType: O O O O N N C C C C C C C C C C C C C C C C H H H H H H H H H H H H H H H H
charge: 0
multiplicity: 1
keywords: wb97x-d3
keywords: def2-TZVPP
keywords: def2/J RIJCOSX GRIDX6 NOFINALGRIDX
keywords: grid4 nofinalgrid
keywords: scfconv7
keywords: smallprint printgap noloewdin
keywords: NOSOSCF
formula: C16H16N2O4
InChI: InChI=1/C16H16N2O4/c1-2-21-15(19)18-13-9-6-10-14(11-13)22-16(20)17-12-7-4-3-5-8-12/h3-11,17-18H,2H2,1H3
38 atoms
O  1.252394 1.411438 -0.692456
O  -4.783865 -1.837267 0.036515
O  1.759515 -0.030272 0.972165
O  -5.158937 0.356056 0.394419
N  -3.061919 -0.476459 0.000791
N  3.27047 0.537898 -0.652819
C  -2.254023 0.657852 0.074677
C  -0.048466 1.553229 -0.24543
C  -0.924762 0.488034 -0.314866
C  -2.681114 1.910044 0.518902
C  -0.45073 2.800703 0.195955
C  -1.776663 2.960321 0.566833
C  4.403982 -0.194753 -0.274989
C  4.350435 -1.361421 0.485184
C  5.636233 0.263957 -0.739779
C  2.078206 0.571127 -0.024434
C  -4.406863 -0.565653 0.162115
C  5.524733 -2.041999 0.777064
C  6.798519 -0.429956 -0.448512
C  6.75156 -1.587322 0.316786
C  -6.186341 -2.137848 0.109107
C  -6.89032 -1.888111 -1.203411
H  -0.588087 -0.473235 -0.683987
H  -3.69887 2.079366 0.827564
H  0.248311 3.624715 0.239516
H  -2.117892 3.927221 0.911107
H  -2.58621 -1.336712 -0.231111
H  3.394394 1.178636 -1.423968
H  3.411966 -1.755827 0.841555
H  5.683416 1.168913 -1.333496
H  5.470234 -2.947323 1.367206
H  7.744134 -0.058609 -0.820549
H  7.658426 -2.129741 0.547154
H  -6.650523 -1.58161 0.923957
H  -6.221921 -3.194581 0.367199
H  -7.925507 -2.219716 -1.118269
H  -6.427962 -2.449875 -2.015129
H  -6.901757 -0.832418 -1.472324
elementType: O N C H
totalener: -1029.90618117 hartree
nucrepener: 1631.27293336 hartree
electener: -2661.17911453 hartree
oneelecener: -4641.68364442 hartree
twoeener: 1980.50452989 hartree
cpcmener: -0.04146616 hartree
kineticenergy: 1025.58792304 hartree
xcener: -97.685164913612 hartree
chargesum: -0.0000000
charge: -0.334537 -0.333663 -0.490133 -0.523698 -0.147809 -0.151970 0.183326 0.255671 -0.188402 -0.252439 -0.238843 -0.123627 0.195783 -0.231753 -0.222587 0.519867 0.541830 -0.137864 -0.125387 -0.197243 0.050084 -0.255942 0.131408 0.159905 0.155341 0.162677 0.168948 0.177858 0.151058 0.142122 0.162747 0.162525 0.162935 0.089110 0.109863 0.096501 0.088330 0.088006
qa: -0.3345 -0.3337 -0.4901 -0.5237 -0.1478 -0.1520 0.1833 0.2557 -0.1884 -0.2524 -0.2388 -0.1236 0.1958 -0.2318 -0.2226 0.5199 0.5418 -0.1379 -0.1254 -0.1972 0.0501 -0.2559 0.1314 0.1599 0.1553 0.1627 0.1689 0.1779 0.1511 0.1421 0.1627 0.1625 0.1629 0.0891 0.1099 0.0965 0.0883 0.0880
va: 2.0863 2.0823 2.0150 1.9745 3.2472 3.2494 3.8441 3.7731 4.0096 3.9433 4.0183 3.9221 3.7342 3.9599 3.9529 4.2446 4.2483 3.9069 3.8894 3.9096 3.8489 3.9153 1.0189 1.0296 0.9994 0.9888 1.0243 1.0170 1.0258 1.0081 0.9902 0.9889 0.9892 1.0119 0.9950 1.0070 1.0043 1.0129
dispcorr: -0.014079938 hartree
energy: -1029.920261106157
dipole: -9.10434 9.95569 0.85135 -6.77967 6.10617 -0.67350 -2.80635 1.27664 -1.52971
magnitude: 1.87574 au
magnitude: 4.76776 debye
