program: Orca
programVersion: 4.2.1
elementType: O O O O N N C C C C C C C C C C C C C C C C H H H H H H H H H H H H H H H H
charge: 0
multiplicity: 1
keywords: wb97x-d3
keywords: def2-TZVPP
keywords: def2/J RIJCOSX GRIDX6 NOFINALGRIDX
keywords: grid4 nofinalgrid
keywords: scfconv7
keywords: smallprint printgap noloewdin
keywords: NOSOSCF
formula: C16H16N2O4
InChI: InChI=1/C16H16N2O4/c1-2-21-15(19)18-13-9-6-10-14(11-13)22-16(20)17-12-7-4-3-5-8-12/h3-11,17-18H,2H2,1H3
38 atoms
O  1.110513 0.034901 -0.840799
O  -5.480009 -1.458006 0.258469
O  2.181181 0.620534 1.060827
O  -5.276184 0.770858 0.512206
N  -3.470194 -0.581397 0.117676
N  3.270592 -0.350118 -0.706684
C  -2.414665 0.325632 0.032023
C  -0.072414 0.616342 -0.424402
C  -1.166808 -0.213142 -0.292196
C  -2.526495 1.698874 0.245946
C  -0.166306 1.985233 -0.231701
C  -1.403673 2.503362 0.109205
C  4.59731 -0.42099 -0.264534
C  5.458275 -1.229746 -1.007888
C  5.098654 0.286777 0.826631
C  2.204323 0.148685 -0.049791
C  -4.788367 -0.320696 0.312766
C  6.796627 -1.329546 -0.670032
C  6.442685 0.172281 1.156255
C  7.299932 -0.629385 0.418163
C  -6.910351 -1.381431 0.370235
C  -7.56472 -0.964365 -0.925854
H  -1.055468 -1.278007 -0.458998
H  -3.466528 2.152535 0.509491
H  0.690028 2.633392 -0.357169
H  -1.504445 3.56821 0.269861
H  -3.230325 -1.548065 -0.049581
H  3.089062 -0.757645 -1.612925
H  5.076397 -1.780871 -1.858816
H  4.467302 0.930864 1.4169
H  7.446403 -1.960138 -1.262189
H  6.819411 0.729293 2.003905
H  8.34517 -0.70611 0.684593
H  -7.189954 -0.719328 1.190342
H  -7.212324 -2.390944 0.641965
H  -8.647266 -1.024902 -0.809933
H  -7.281801 -1.626054 -1.744688
H  -7.319195 0.059706 -1.204309
elementType: O N C H
totalener: -1029.90605067 hartree
nucrepener: 1618.73890366 hartree
electener: -2648.64495433 hartree
oneelecener: -4616.55546857 hartree
twoeener: 1967.91051425 hartree
cpcmener: -0.04184873 hartree
kineticenergy: 1025.58725182 hartree
xcener: -97.685736776943 hartree
chargesum: -0.0000000
charge: -0.331557 -0.333960 -0.490108 -0.522399 -0.143986 -0.142076 0.183909 0.259270 -0.214548 -0.254482 -0.218785 -0.130455 0.199887 -0.227237 -0.240516 0.522358 0.540884 -0.119769 -0.141668 -0.201896 0.052162 -0.259127 0.134596 0.163120 0.151498 0.162739 0.167777 0.175245 0.141080 0.155619 0.162019 0.163216 0.163273 0.090447 0.109458 0.097222 0.089418 0.087369
qa: -0.3316 -0.3340 -0.4901 -0.5224 -0.1440 -0.1421 0.1839 0.2593 -0.2145 -0.2545 -0.2188 -0.1305 0.1999 -0.2272 -0.2405 0.5224 0.5409 -0.1198 -0.1417 -0.2019 0.0522 -0.2591 0.1346 0.1631 0.1515 0.1627 0.1678 0.1752 0.1411 0.1556 0.1620 0.1632 0.1633 0.0904 0.1095 0.0972 0.0894 0.0874
va: 2.0870 2.0818 2.0140 1.9760 3.2484 3.2623 3.8606 3.7830 4.0459 3.9403 3.9940 3.9235 3.7572 3.9412 3.9479 4.2369 4.2475 3.8867 3.9099 3.9117 3.8470 3.9131 1.0176 1.0300 1.0012 0.9901 1.0246 1.0187 1.0084 1.0284 0.9890 0.9899 0.9893 1.0111 0.9954 1.0066 1.0039 1.0142
dispcorr: -0.013982529 hartree
energy: -1029.920033198554
dipole: -10.27836 10.41049 0.13213 -3.37757 1.46252 -1.91505 -2.47642 0.80339 -1.67303
magnitude: 2.54635 au
magnitude: 6.47231 debye
