program: Orca
programVersion: 4.2.1
elementType: O O O O N N C C C C C C C C C C C C C C C C H H H H H H H H H H H H H H H H
charge: 0
multiplicity: 1
keywords: wb97x-d3
keywords: def2-TZVPP
keywords: def2/J RIJCOSX GRIDX6 NOFINALGRIDX
keywords: grid4 nofinalgrid
keywords: scfconv7
keywords: smallprint printgap noloewdin
keywords: NOSOSCF
formula: C16H16N2O4
InChI: InChI=1/C16H16N2O4/c1-2-21-15(19)18-13-9-6-10-14(11-13)22-16(20)17-12-7-4-3-5-8-12/h3-11,17-18H,2H2,1H3
38 atoms
O  0.83557 0.470968 -0.964163
O  -5.581294 -0.618706 0.042625
O  1.96669 0.857077 0.951559
O  -3.576846 -1.437134 -0.579571
N  -3.85395 0.730769 0.103827
N  2.879062 -0.325116 -0.781306
C  -2.585027 1.282974 -0.053938
C  -0.242999 1.221898 -0.54383
C  -1.448695 0.554522 -0.406671
C  -2.469999 2.6561 0.173382
C  -0.115932 2.584131 -0.338421
C  -1.250064 3.290906 0.030539
C  4.144115 -0.63867 -0.264226
C  4.747099 -1.816164 -0.702883
C  4.830246 0.195757 0.616363
C  1.9135 0.378511 -0.152502
C  -4.271538 -0.530722 -0.179348
C  6.017598 -2.156974 -0.267596
C  6.096662 -0.163702 1.054496
C  6.699041 -1.335397 0.619361
C  -6.219056 -1.887881 -0.156907
C  -6.047258 -2.807452 1.028781
H  -1.485324 -0.509222 -0.581632
H  -3.343437 3.231399 0.455649
H  0.831808 3.088275 -0.469336
H  -1.183551 4.356526 0.204514
H  -4.568633 1.371601 0.417186
H  2.634972 -0.749836 -1.664531
H  4.218951 -2.468963 -1.387809
H  4.399408 1.126621 0.952536
H  6.470795 -3.074569 -0.619675
H  6.620305 0.492924 1.737358
H  7.68931 -1.602424 0.963938
H  -5.860798 -2.351971 -1.076899
H  -7.27024 -1.641121 -0.299093
H  -6.420657 -2.349039 1.945146
H  -5.007562 -3.09544 1.181919
H  -6.621154 -3.719068 0.8570
elementType: O N C H
totalener: -1029.91218392 hartree
nucrepener: 1638.76844347 hartree
electener: -2668.68062739 hartree
oneelecener: -4657.01153856 hartree
twoeener: 1988.33091116 hartree
cpcmener: -0.03490736 hartree
kineticenergy: 1025.60111146 hartree
xcener: -97.685353649103 hartree
chargesum: -0.0000000
charge: -0.329084 -0.329422 -0.465398 -0.499909 -0.148498 -0.165495 0.184892 0.238504 -0.230987 -0.228878 -0.206424 -0.113081 0.196923 -0.223616 -0.217422 0.503840 0.528996 -0.126230 -0.136335 -0.187362 0.047355 -0.255585 0.149681 0.135421 0.145530 0.159475 0.164345 0.176278 0.140725 0.146321 0.158503 0.158564 0.159624 0.090024 0.107589 0.087216 0.089410 0.094507
qa: -0.3291 -0.3294 -0.4654 -0.4999 -0.1485 -0.1655 0.1849 0.2385 -0.2310 -0.2289 -0.2064 -0.1131 0.1969 -0.2236 -0.2174 0.5038 0.5290 -0.1262 -0.1363 -0.1874 0.0474 -0.2556 0.1497 0.1354 0.1455 0.1595 0.1643 0.1763 0.1407 0.1463 0.1585 0.1586 0.1596 0.0900 0.1076 0.0872 0.0894 0.0945
va: 2.0929 2.0851 2.0433 2.0033 3.2430 3.2327 3.8566 3.8199 4.0515 3.9376 3.9927 3.9123 3.7130 3.9735 3.9747 4.2642 4.2627 3.9018 3.9131 3.9122 3.8559 3.9137 1.0432 1.0092 1.0021 0.9895 1.0262 1.0175 1.0082 1.0238 0.9903 0.9913 0.9902 1.0111 0.9946 1.0047 1.0135 1.0072
dispcorr: -0.014114062 hartree
energy: -1029.926297980126
dipole: -8.11227 6.92397 -1.18830 -7.21510 7.37821 0.16311 2.95289 -3.65862 -0.70573
magnitude: 1.39166 au
magnitude: 3.53732 debye
