program: Orca
programVersion: 4.2.1
elementType: O O O O N N C C C C C C C C C C C C C C C C H H H H H H H H H H H H H H H H
charge: 0
multiplicity: 1
keywords: wb97x-d3
keywords: def2-TZVPP
keywords: def2/J RIJCOSX GRIDX6 NOFINALGRIDX
keywords: grid4 nofinalgrid
keywords: scfconv7
keywords: smallprint printgap noloewdin
keywords: NOSOSCF
formula: C16H16N2O4
InChI: InChI=1/C16H16N2O4/c1-2-21-15(19)18-13-9-6-10-14(11-13)22-16(20)17-12-7-4-3-5-8-12/h3-11,17-18H,2H2,1H3
38 atoms
O  0.820551 0.45212 0.790533
O  -5.594178 -0.640917 -0.059288
O  2.072243 0.971467 -1.020315
O  -3.550474 -1.46755 0.402755
N  -3.88072 0.726679 -0.162047
N  2.863407 -0.338879 0.687076
C  -2.606984 1.279454 -0.048663
C  -0.250842 1.216876 0.381285
C  -1.460713 0.550949 0.267021
C  -2.498865 2.654608 -0.269057
C  -0.129801 2.58085 0.182814
C  -1.275425 3.287635 -0.152395
C  4.174936 -0.624727 0.292458
C  4.823844 -1.650739 0.982112
C  4.863397 0.066001 -0.704376
C  1.946524 0.415969 0.04213
C  -4.274199 -0.549881 0.087897
C  6.134391 -1.98149 0.68419
C  6.176814 -0.28018 -0.994092
C  6.822418 -1.298595 -0.309898
C  -6.207266 -1.924784 0.126279
C  -6.106749 -2.790174 -1.107479
H  -1.492532 -0.51333 0.438193
H  -3.379634 3.232991 -0.521249
H  0.816611 3.090503 0.297952
H  -1.213685 4.355044 -0.317241
H  -4.615108 1.375755 -0.405899
H  2.555914 -0.784894 1.54032
H  4.297573 -2.194035 1.758506
H  4.400358 0.871432 -1.251632
H  6.616149 -2.780338 1.232978
H  6.70023 0.267212 -1.767777
H  7.847091 -1.555125 -0.544804
H  -7.248709 -1.696857 0.34897
H  -5.783865 -2.424086 0.999035
H  -6.663397 -3.713101 -0.939651
H  -5.077309 -3.062274 -1.339127
H  -6.540899 -2.295115 -1.976882
elementType: O N C H
totalener: -1029.91244379 hartree
nucrepener: 1635.24110894 hartree
electener: -2665.15355273 hartree
oneelecener: -4649.82726885 hartree
twoeener: 1984.67371612 hartree
cpcmener: -0.03374835 hartree
kineticenergy: 1025.58143423 hartree
xcener: -97.683260455623 hartree
chargesum: -0.0000000
charge: -0.326460 -0.329416 -0.464727 -0.500473 -0.147787 -0.147395 0.181896 0.239720 -0.230709 -0.229008 -0.206828 -0.115007 0.202157 -0.226100 -0.235458 0.509613 0.529592 -0.120143 -0.134482 -0.197771 0.049438 -0.256711 0.151276 0.135883 0.143638 0.159066 0.164160 0.169701 0.136328 0.152464 0.158506 0.158289 0.158569 0.107461 0.089045 0.094850 0.089401 0.087424
qa: -0.3265 -0.3294 -0.4647 -0.5005 -0.1478 -0.1474 0.1819 0.2397 -0.2307 -0.2290 -0.2068 -0.1150 0.2022 -0.2261 -0.2355 0.5096 0.5296 -0.1201 -0.1345 -0.1978 0.0494 -0.2567 0.1513 0.1359 0.1436 0.1591 0.1642 0.1697 0.1363 0.1525 0.1585 0.1583 0.1586 0.1075 0.0890 0.0948 0.0894 0.0874
va: 2.0958 2.0859 2.0454 2.0025 3.2448 3.2536 3.8711 3.8208 4.0286 3.9383 3.9835 3.9172 3.7610 3.9434 3.9547 4.2520 4.2607 3.8971 3.9111 3.9164 3.8548 3.9141 1.0446 1.0089 1.0064 0.9899 1.0262 1.0226 1.0093 1.0296 0.9899 0.9912 0.9907 0.9946 1.0116 1.0073 1.0132 1.0046
dispcorr: -0.013982017 hartree
energy: -1029.926425807520
dipole: -8.26432 6.90071 -1.36361 -7.25081 7.37011 0.11931 -2.30351 3.13265 0.82914
magnitude: 1.60035 au
magnitude: 4.06778 debye
