program: Orca
programVersion: 4.2.1
elementType: O O O O N N C C C C C C C C C C C C C C C C H H H H H H H H H H H H H H H H
charge: 0
multiplicity: 1
keywords: wb97x-d3
keywords: def2-TZVPP
keywords: def2/J RIJCOSX GRIDX6 NOFINALGRIDX
keywords: grid4 nofinalgrid
keywords: scfconv7
keywords: smallprint printgap noloewdin
keywords: NOSOSCF
formula: C16H16N2O4
InChI: InChI=1/C16H16N2O4/c1-2-21-15(19)18-13-9-6-10-14(11-13)22-16(20)17-12-7-4-3-5-8-12/h3-11,17-18H,2H2,1H3
38 atoms
O  0.878345 0.387308 0.838493
O  -5.465512 -0.838621 -0.321407
O  2.106616 1.014326 -0.950621
O  -3.418782 -1.634147 0.160143
N  -3.794554 0.584223 -0.273779
N  2.943489 -0.340603 0.697329
C  -2.545854 1.165763 -0.068386
C  -0.208611 1.141901 0.4501
C  -1.388469 0.449366 0.234462
C  -2.476187 2.556722 -0.175408
C  -0.125878 2.520176 0.364019
C  -1.280472 3.216625 0.039431
C  4.255137 -0.58471 0.277137
C  4.93558 -1.618891 0.922481
C  4.914213 0.15565 -0.703279
C  2.003037 0.413296 0.088241
C  -4.157234 -0.716249 -0.117182
C  6.249272 -1.908244 0.597569
C  6.230771 -0.149913 -1.021138
C  6.908282 -1.175739 -0.38023
C  -6.03962 -2.146374 -0.181587
C  -7.529088 -2.010624 -0.369328
H  -1.390322 -0.625736 0.319537
H  -3.366218 3.125463 -0.416241
H  0.800015 3.044858 0.555394
H  -1.249089 4.295055 -0.039632
H  -4.540453 1.226569 -0.498987
H  2.655637 -0.822446 1.537379
H  4.432483 -2.19994 1.686675
H  4.425725 0.968514 -1.21632
H  6.756695 -2.713517 1.112762
H  6.730291 0.434883 -1.782769
H  7.934888 -1.400469 -0.636829
H  -5.810397 -2.548348 0.807259
H  -5.612707 -2.819222 -0.928269
H  -7.99148 -2.992148 -0.264065
H  -7.780234 -1.629302 -1.359517
H  -7.971048 -1.353338 0.380134
elementType: O N C H
totalener: -1029.91332091 hartree
nucrepener: 1628.02738473 hartree
electener: -2657.94070564 hartree
oneelecener: -4635.36104219 hartree
twoeener: 1977.42033655 hartree
cpcmener: -0.03451759 hartree
kineticenergy: 1025.60157556 hartree
xcener: -97.685956975225 hartree
chargesum: -0.0000000
charge: -0.328307 -0.323551 -0.464849 -0.497996 -0.148223 -0.147503 0.182694 0.238417 -0.228990 -0.227923 -0.207284 -0.114009 0.202716 -0.226736 -0.235176 0.509986 0.528791 -0.119788 -0.135673 -0.197491 0.045697 -0.253748 0.149899 0.135608 0.145051 0.158690 0.164568 0.169451 0.136710 0.152929 0.158173 0.158222 0.158638 0.095675 0.098659 0.089017 0.088984 0.088673
qa: -0.3283 -0.3236 -0.4648 -0.4980 -0.1482 -0.1475 0.1827 0.2384 -0.2290 -0.2279 -0.2073 -0.1140 0.2027 -0.2267 -0.2352 0.5100 0.5288 -0.1198 -0.1357 -0.1975 0.0457 -0.2537 0.1499 0.1356 0.1451 0.1587 0.1646 0.1695 0.1367 0.1529 0.1582 0.1582 0.1586 0.0957 0.0987 0.0890 0.0890 0.0887
va: 2.0935 2.0839 2.0448 2.0096 3.2437 3.2543 3.8653 3.8198 4.0380 3.9370 3.9898 3.9141 3.7605 3.9445 3.9530 4.2509 4.2604 3.8978 3.9118 3.9163 3.8385 3.9730 1.0452 1.0091 1.0043 0.9899 1.0255 1.0226 1.0092 1.0298 0.9901 0.9913 0.9907 0.9974 0.9956 1.0066 1.0028 1.0028
dispcorr: -0.013697194 hartree
energy: -1029.927018107658
dipole: -11.26092 9.83953 -1.42139 -5.44811 5.55813 0.11002 -0.71388 1.59581 0.88193
magnitude: 1.67638 au
magnitude: 4.26102 debye
