program: Orca
programVersion: 4.2.1
elementType: O O O O N N C C C C C C C C C C C C C C C C H H H H H H H H H H H H H H H H
charge: 0
multiplicity: 1
keywords: wb97x-d3
keywords: def2-TZVPP
keywords: def2/J RIJCOSX GRIDX6 NOFINALGRIDX
keywords: grid4 nofinalgrid
keywords: scfconv7
keywords: smallprint printgap noloewdin
keywords: NOSOSCF
formula: C16H16N2O4
InChI: InChI=1/C16H16N2O4/c1-2-21-15(19)18-13-9-6-10-14(11-13)22-16(20)17-12-7-4-3-5-8-12/h3-11,17-18H,2H2,1H3
38 atoms
O  1.29929 1.470773 0.498813
O  -4.903886 -1.577822 0.247961
O  1.623625 -0.375718 -0.774148
O  -5.209283 0.586527 -0.287083
N  -3.134405 -0.279701 0.171794
N  3.310235 0.605689 0.431203
C  -2.282101 0.812159 0.007147
C  -0.023403 1.620424 0.14894
C  -0.937328 0.59696 0.310634
C  -2.695533 2.066809 -0.438836
C  -0.415853 2.86962 -0.299133
C  -1.755758 3.074596 -0.580428
C  4.421199 -0.204693 0.176654
C  4.384915 -1.3622 -0.598401
C  5.628892 0.190603 0.752848
C  2.041097 0.468308 -0.032929
C  -4.488278 -0.328283 0.012446
C  5.547257 -2.097382 -0.778032
C  6.778758 -0.553773 0.563503
C  6.746749 -1.707289 -0.205179
C  -6.304746 -1.824053 0.122866
C  -6.537146 -3.29177 0.391005
H  -0.611569 -0.370805 0.669536
H  -3.729617 2.258096 -0.671065
H  0.311493 3.661143 -0.415962
H  -2.081987 4.045977 -0.927177
H  -2.69202 -1.148682 0.423018
H  3.47373 1.396874 1.032893
H  3.467593 -1.68919 -1.059521
H  5.670782 1.09067 1.356177
H  5.50509 -2.994314 -1.3819
H  7.703322 -0.226691 1.020134
H  7.643961 -2.291892 -0.35531
H  -6.644021 -1.552171 -0.879083
H  -6.85698 -1.204422 0.833008
H  -6.219632 -3.572054 1.394879
H  -6.006509 -3.918549 -0.325003
H  -7.600521 -3.51312 0.303654
totalener: -1029.88967568 hartree
nucrepener: 1624.07084857 hartree
electener: -2653.96052424 hartree
oneelecener: -4626.38830397 hartree
twoeener: 1972.42777973 hartree
kineticenergy: 1025.63795092 hartree
xcener: -97.686747694550 hartree
chargesum: -0.0000000
charge: -0.333339 -0.317035 -0.385521 -0.408160 -0.173399 -0.167748 0.167842 0.240385 -0.129770 -0.205269 -0.210243 -0.082018 0.201819 -0.202822 -0.203053 0.470877 0.482466 -0.095081 -0.098482 -0.159897 0.036454 -0.235322 0.085776 0.152681 0.119566 0.124678 0.135952 0.136244 0.152899 0.094394 0.126208 0.124946 0.125407 0.089580 0.090330 0.083500 0.085238 0.079918
qa: -0.3333 -0.3170 -0.3855 -0.4082 -0.1734 -0.1677 0.1678 0.2404 -0.1298 -0.2053 -0.2102 -0.0820 0.2018 -0.2028 -0.2031 0.4709 0.4825 -0.0951 -0.0985 -0.1599 0.0365 -0.2353 0.0858 0.1527 0.1196 0.1247 0.1360 0.1362 0.1529 0.0944 0.1262 0.1249 0.1254 0.0896 0.0903 0.0835 0.0852 0.0799
va: 2.0874 2.0761 2.1232 2.0991 3.2325 3.2464 3.9403 3.9277 4.0153 3.9968 4.0540 3.9518 3.8532 3.9990 3.9921 4.2713 4.2891 3.9440 3.9923 3.9785 3.8742 3.9582 1.0370 1.0332 1.0111 1.0005 1.0473 1.0467 1.0318 1.0178 1.0009 1.0002 1.0006 0.9996 0.9984 1.0047 1.0043 1.0089
dispcorr: -0.013632046 hartree
energy: -1029.903307723476
dipole: -8.24174 8.67440 0.43266 -9.40982 9.04173 -0.36810 1.00050 -0.25482 0.74568
magnitude: 0.93741 au
magnitude: 2.38270 debye
