program: Orca
programVersion: 4.2.1
elementType: O O O O N N C C C C C C C C C C C C C C C C H H H H H H H H H H H H H H H H
charge: 0
multiplicity: 1
keywords: wb97x-d3
keywords: def2-TZVPP
keywords: def2/J RIJCOSX GRIDX6 NOFINALGRIDX
keywords: grid4 nofinalgrid
keywords: scfconv7
keywords: smallprint printgap noloewdin
keywords: NOSOSCF
formula: C16H16N2O4
InChI: InChI=1/C16H16N2O4/c1-2-21-15(19)18-13-9-6-10-14(11-13)22-16(20)17-12-7-4-3-5-8-12/h3-11,17-18H,2H2,1H3
38 atoms
O  0.808319 0.407543 0.751535
O  -5.498741 -0.782162 -0.559559
O  2.173943 1.296129 -0.822481
O  -3.464063 -1.582252 -0.010732
N  -3.854988 0.654225 -0.328408
N  2.84627 -0.378643 0.59305
C  -2.612161 1.238469 -0.0846
C  -0.271147 1.192441 0.415886
C  -1.454273 0.512232 0.180351
C  -2.547633 2.631656 -0.121526
C  -0.192535 2.574086 0.391271
C  -1.350828 3.281492 0.113487
C  4.17722 -0.60754 0.232139
C  4.868301 0.136165 -0.722362
C  4.835774 -1.646338 0.891269
C  1.974967 0.524428 0.071808
C  -4.197609 -0.664486 -0.27122
C  6.193723 -0.168849 -0.99414
C  6.157575 -1.937377 0.608227
C  6.849412 -1.198584 -0.339238
C  -6.06188 -2.094215 -0.525226
C  -6.40921 -2.53652 0.879922
H  -1.463237 -0.56537 0.214526
H  -3.438773 3.212165 -0.329482
H  0.735905 3.091382 0.58116
H  -1.320162 4.362178 0.083461
H  -4.600639 1.291222 -0.556078
H  2.483684 -0.96452 1.327713
H  4.385665 0.94135 -1.251263
H  4.308892 -2.235057 1.633873
H  6.718084 0.417949 -1.736732
H  6.645424 -2.748206 1.132686
H  7.883211 -1.423114 -0.563071
H  -5.387733 -2.807582 -1.001939
H  -6.960474 -2.020198 -1.137013
H  -7.073751 -1.823504 1.367615
H  -5.519055 -2.662514 1.49348
H  -6.92423 -3.497008 0.840787
totalener: -1029.88973929 hartree
nucrepener: 1635.66058767 hartree
electener: -2665.55032696 hartree
oneelecener: -4649.78441214 hartree
twoeener: 1984.23408519 hartree
kineticenergy: 1025.64159739 hartree
xcener: -97.688347790439 hartree
chargesum: 0.0000000
charge: -0.327185 -0.320325 -0.382840 -0.418143 -0.171130 -0.167452 0.186038 0.241791 -0.200470 -0.204331 -0.145631 -0.102508 0.203723 -0.201670 -0.204780 0.472999 0.491416 -0.096303 -0.096825 -0.161071 0.033323 -0.252377 0.146756 0.094590 0.114160 0.123192 0.134967 0.136953 0.151566 0.094838 0.125555 0.123487 0.124590 0.090320 0.096593 0.082219 0.101552 0.082412
qa: -0.3272 -0.3203 -0.3828 -0.4181 -0.1711 -0.1675 0.1860 0.2418 -0.2005 -0.2043 -0.1456 -0.1025 0.2037 -0.2017 -0.2048 0.4730 0.4914 -0.0963 -0.0968 -0.1611 0.0333 -0.2524 0.1468 0.0946 0.1142 0.1232 0.1350 0.1370 0.1516 0.0948 0.1256 0.1235 0.1246 0.0903 0.0966 0.0822 0.1016 0.0824
va: 2.0933 2.0818 2.1249 2.0839 3.2360 3.2477 3.9139 3.8841 4.0466 3.9964 4.0264 4.0167 3.8511 3.9982 3.9926 4.2647 4.2768 3.9433 3.9913 3.9773 3.8907 3.9069 1.0447 1.0176 1.0182 1.0014 1.0468 1.0461 1.0325 1.0176 1.0007 1.0004 1.0008 1.0111 0.9935 1.0055 1.0125 1.0105
dispcorr: -0.013932972 hartree
energy: -1029.903672264679
dipole: -9.04276 7.95195 -1.09081 -7.01267 6.87967 -0.13300 1.74671 -1.26295 0.48377
magnitude: 1.20066 au
magnitude: 3.05184 debye
