program: Orca
programVersion: 4.2.1
elementType: O O O O N N C C C C C C C C C C C C C C C C H H H H H H H H H H H H H H H H
charge: 0
multiplicity: 1
keywords: wb97x-d3
keywords: def2-TZVPP
keywords: def2/J RIJCOSX GRIDX6 NOFINALGRIDX
keywords: grid4 nofinalgrid
keywords: scfconv7
keywords: smallprint printgap noloewdin
keywords: NOSOSCF
formula: C16H16N2O4
InChI: InChI=1/C16H16N2O4/c1-2-21-15(19)18-13-9-6-10-14(11-13)22-16(20)17-12-7-4-3-5-8-12/h3-11,17-18H,2H2,1H3
38 atoms
O  1.124024 0.183191 0.881819
O  -5.493409 -1.230871 -0.154292
O  2.246834 0.897995 -0.949743
O  -5.288086 1.002378 -0.340106
N  -3.482174 -0.365155 0.027154
N  3.244439 -0.345252 0.700129
C  -2.412759 0.527025 0.109727
C  -0.052902 0.792343 0.508375
C  -1.16267 -0.021895 0.397862
C  -2.522619 1.903245 -0.078511
C  -0.144803 2.161797 0.329662
C  -1.38864 2.69238 0.03421
C  4.568525 -0.475066 0.269092
C  5.420172 -1.226511 1.079724
C  5.071262 0.097179 -0.897947
C  2.22049 0.309074 0.092325
C  -4.802559 -0.085127 -0.172761
C  6.748133 -1.403144 0.736821
C  6.405659 -0.08974 -1.22703
C  7.252872 -0.834489 -0.422691
C  -6.905209 -1.130163 -0.345368
C  -7.480707 -2.523837 -0.263228
H  -1.048171 -1.089204 0.548733
H  -3.472818 2.356827 -0.304768
H  0.722616 2.799529 0.417735
H  -1.483627 3.759807 -0.113076
H  -3.256159 -1.33799 0.154111
H  3.024797 -0.784736 1.579095
H  5.040908 -1.678362 1.989717
H  4.436912 0.680527 -1.544829
H  7.388655 -1.990055 1.381703
H  6.783286 0.361069 -2.13544
H  8.290905 -0.96989 -0.69384
H  -7.118817 -0.676279 -1.315709
H  -7.340052 -0.483075 0.419652
H  -7.070542 -3.174395 -1.03505
H  -8.560291 -2.478723 -0.404725
H  -7.291087 -2.979805 0.708087
totalener: -1029.88925951 hartree
nucrepener: 1611.79466276 hartree
electener: -2641.68392227 hartree
oneelecener: -4601.82821364 hartree
twoeener: 1960.14429137 hartree
kineticenergy: 1025.63687832 hartree
xcener: -97.685760597986 hartree
chargesum: 0.0000000
charge: -0.336836 -0.318311 -0.376095 -0.406556 -0.172589 -0.168054 0.186459 0.242970 -0.201233 -0.203028 -0.150664 -0.095378 0.203753 -0.207196 -0.202282 0.465159 0.482909 -0.094690 -0.096164 -0.161553 0.036329 -0.235085 0.091369 0.155177 0.114384 0.124954 0.133162 0.135184 0.093969 0.153235 0.123629 0.127082 0.126034 0.090530 0.090542 0.084781 0.080819 0.083286
qa: -0.3368 -0.3183 -0.3761 -0.4066 -0.1726 -0.1681 0.1865 0.2430 -0.2012 -0.2030 -0.1507 -0.0954 0.2038 -0.2072 -0.2023 0.4652 0.4829 -0.0947 -0.0962 -0.1616 0.0363 -0.2351 0.0914 0.1552 0.1144 0.1250 0.1332 0.1352 0.0940 0.1532 0.1236 0.1271 0.1260 0.0905 0.0905 0.0848 0.0808 0.0833
va: 2.0773 2.0746 2.1322 2.1004 3.2280 3.2435 3.9161 3.9536 4.0861 3.9957 4.0343 3.9571 3.8504 3.9952 4.0006 4.2750 4.2879 3.9898 3.9440 3.9791 3.8733 3.9583 1.0275 1.0321 1.0144 1.0015 1.0481 1.0469 1.0178 1.0317 1.0005 1.0005 1.0006 0.9989 0.9991 1.0041 1.0087 1.0047
dispcorr: -0.013590651 hartree
energy: -1029.902850160907
dipole: -10.23435 10.10047 -0.13388 -7.41538 6.05714 -1.35824 -0.46413 1.30199 0.83786
magnitude: 1.60148 au
magnitude: 4.07064 debye
