program: Gaussian 09
title: 000005010
version: EM64L-G09RevD.01
frameworkgroup: C1[X(C23H28N2O4)]
method: RPBEPBE
basis: SDD
operation: Freq
keyword: #p
keyword: freq=noraman
keyword: PBEPBE/SDD
title: #p freq=noraman PBEPBE/SDD
converged: NO YES NO NO
title: Mulliken charges:
elementType: O O O O N N C C C C C C C C C C C C C C C C C C C C C C C H H H H H H H H H H H H H H H H H H H H H H H H H H H H
charge: -0.258952 -0.243085 -0.270162 -0.266776 -0.021285 -0.015123 -0.121269 -0.053397 -0.521537 -0.114397 -0.498785 -0.535467 -0.466722 -0.358172 -0.082547 0.507482 -0.630139 0.272129 -0.324099 0.318260 -0.076094 -0.515692 -0.399044 -0.315830 0.297250 -0.361116 -0.240118 -0.670489 -0.536940 0.228844 0.257965 0.237437 0.218915 0.213055 0.221965 0.215911 0.240352 0.239791 0.228585 0.229311 0.260829 0.225861 0.217684 0.215147 0.245049 0.233751 0.234111 0.258544 0.245283 0.234393 0.229704 0.232640 0.234725 0.212449 0.223009 0.245909 0.220898
chargesum: 0.00000
title: Mulliken charges with hydrogens summed into heavy atoms:
elementType: O O O O N N C C C C C C C C C C C C C C C C C C C C C C C
charge: -0.258952 -0.243085 -0.270162 -0.266776 -0.021285 -0.015123 0.107575 0.204568 -0.065184 0.098658 -0.060909 -0.055325 -0.008827 -0.097343 0.143314 0.507482 -0.197308 0.272129 -0.079050 0.318260 -0.076094 -0.281941 -0.164933 -0.057286 0.297250 -0.115833 0.223979 0.009325 0.152877
polarizability: 3.07787095e+02 3.57350661e+01 2.76193081e+02 2.01857352e+01 2.79128200e+01 2.65301183e+02
1716.lowfreq: -7.7606 -6.4793 -5.9837 0.0003 0.0008 0.0008 8.6628 17.7342 24.2334
frequency: 6.1394 17.7287 24.0462 33.4857 34.1445 38.2643 66.8346 70.1305 74.3195 76.5001 96.4162 116.7621 124.8697 144.4790 169.1314 179.3812 191.0145 200.7344 220.7339 225.0715 239.1668 245.1433 261.7504 285.9878 305.8993 324.7663 332.5128 344.5847 358.4703 370.4326 377.4599 418.2043 423.3943 442.6900 491.1992 518.7341 520.2183 543.1393 549.9666 551.3342 577.2082 593.5204 607.9408 632.5451 660.1976 671.3067 681.7059 692.7053 697.1438 749.6450 756.9046 777.8409 793.6054 802.1587 802.9467 809.9466 823.8458 829.0271 847.8451 854.3862 868.2956 875.9737 881.4769 890.1915 922.6704 930.3289 937.8067 954.8883 957.9647 965.5200 977.9648 985.4510 999.6833 1004.0491 1005.3242 1010.7019 1016.3703 1041.3866 1049.2536 1063.8890 1072.6424 1082.1659 1084.3150 1110.0230 1113.5219 1131.5795 1135.0099 1137.8604 1153.0149 1159.0240 1169.5491 1177.3000 1189.0104 1196.9531 1226.3181 1228.7002 1231.1443 1245.0836 1252.8682 1258.9812 1265.5461 1269.1270 1287.3076 1294.1295 1296.9888 1300.8278 1310.1616 1312.8289 1315.0926 1323.5414 1338.1228 1344.6172 1349.7982 1361.1855 1364.2039 1367.9827 1385.5884 1403.2034 1428.1211 1429.3148 1437.3352 1461.3137 1462.4180 1463.5324 1466.0369 1468.4655 1471.1032 1473.8695 1475.2386 1483.8474 1487.8641 1509.2043 1549.8433 1582.7727 1621.0047 1632.4835 1650.4524 2960.7032 2978.8309 2983.0586 2989.9788 2998.3706 2998.4391 2999.4050 3011.7066 3012.3811 3035.4961 3040.5874 3049.5587 3053.7590 3058.3122 3061.7087 3066.3940 3072.1073 3075.3687 3086.2070 3095.0205 3111.1896 3122.1881 3124.5922 3150.8619 3154.6214 3167.7348 3173.2191 3191.2577
redmass: 4.6721 4.9796 4.0319 5.2968 3.7820 3.5459 3.7927 3.4885 3.6667 2.9868 3.7886 3.0420 4.3645 3.4101 4.5714 3.2698 4.1185 2.6103 1.9904 3.0758 1.5984 1.2970 4.1118 6.1110 2.5214 3.4609 2.4106 4.0313 2.9161 3.4302 2.7264 4.5532 3.2551 3.1543 4.0197 5.1863 3.5686 4.5559 4.1481 4.6682 3.6950 4.6963 4.2193 6.0077 2.0179 5.0295 4.2740 6.4463 9.2690 3.6488 4.7698 2.0774 2.0367 1.1003 1.8347 2.3544 1.8908 2.7495 4.7868 1.9563 1.6424 4.7335 2.4878 5.7754 2.0738 2.1374 1.4720 1.6184 1.5973 1.3597 2.7398 3.3617 1.9855 1.3174 4.3699 2.7162 2.8398 2.7216 3.6557 2.2851 2.1969 2.9743 2.1996 1.2570 2.2906 1.9945 1.3812 1.4604 1.2992 1.3201 2.2774 2.4318 2.0079 1.8780 1.6603 1.6864 1.4979 1.5347 1.1309 1.5002 2.5733 1.4502 1.3324 1.3162 1.2586 1.3183 1.4405 1.4147 1.6549 1.3281 1.3982 1.4021 1.8629 1.4728 1.4061 2.0535 3.0431 1.2706 2.1782 1.2103 1.4958 1.0398 2.1169 1.1711 1.0903 1.0519 1.0869 1.1272 1.0598 1.0883 1.0718 3.9267 6.9103 6.6986 10.6742 6.9344 4.6531 1.0329 1.0834 1.0644 1.0598 1.0416 1.0577 1.0803 1.0581 1.0622 1.0891 1.1019 1.1041 1.0933 1.0944 1.0910 1.0946 1.1072 1.1034 1.0706 1.0984 1.1027 1.0888 1.0993 1.0872 1.0952 1.0909 1.0969 1.1142
irintensity: 0.2691 0.1511 0.1134 0.0303 0.0279 0.5262 1.7427 1.3394 3.1445 1.1049 0.6635 3.7391 2.3731 0.3274 0.3271 1.6642 0.0858 6.9821 0.3413 3.7272 3.1774 1.9125 6.8768 1.5378 1.2144 2.2383 0.4623 11.8730 6.4717 5.9356 0.7626 0.6318 1.3653 6.4420 1.4862 4.4162 8.8268 5.4025 9.4047 9.9778 1.5276 10.8877 2.5146 7.1849 16.6731 7.5000 3.1781 17.2324 12.5882 6.3652 28.7084 2.6529 7.8220 2.6109 15.2619 9.6651 0.8080 92.3575 0.5405 34.0340 36.9298 11.4466 20.9080 63.3087 7.3241 13.4103 74.0497 5.6589 7.2717 2.3499 3.4124 85.6209 23.0231 3.1107 62.9590 39.9096 13.8062 44.9098 7.5225 2.8232 10.3558 2.5531 17.9426 0.1201 31.9498 41.7585 5.2958 5.5462 0.2976 11.1766 366.8673 535.0141 255.9619 55.1811 13.1861 9.4647 21.9221 12.0473 0.0922 46.5775 80.6943 12.2403 2.2999 2.9541 3.6685 6.0203 2.7062 8.7113 8.4699 4.1231 0.7726 2.7776 1.8970 0.6319 8.7686 5.8781 2.1105 22.3034 6.4832 4.2572 8.0265 12.1845 43.0206 26.4027 2.1453 12.4230 10.4779 22.9985 5.0760 11.4034 14.9183 86.7337 26.4752 15.3166 140.1157 129.1450 34.7839 90.1321 21.4613 34.6539 35.1077 29.9239 30.3138 6.2190 17.5259 51.0368 31.2132 14.3448 45.3487 19.4130 15.3692 0.5546 58.8922 8.2500 59.2509 8.7288 27.0193 39.3830 23.1443 22.7644 4.1488 15.5853 12.2320 11.5233 28.0507
temp: 298.150 k
press: 1.00000 atm
elementType: 8 8 8 8 7 7 6 6 6 6 6 6 6 6 6 6 6 6 6 6 6 6 6 6 6 6 6 6 6 1 1 1 1 1 1 1 1 1 1 1 1 1 1 1 1 1 1 1 1 1 1 1 1 1 1 1 1
symmnumber: 1
zpe: 1229997.1 jmol-1
zpe.correction: 0.468481 hartree
zpe.thermalcorrener: 0.496142 hartree
zpe.thermalcorrenthalpy: 0.497086 hartree
zpe.thermalcorrgfe: 0.406050 hartree
zpe.sumelectzpe: -1301.438854 hartree
zpe.sumelectthermal: -1301.411194 hartree
zpe.sumelectthermalent: -1301.410249 hartree
zpe.sumelectthermalfe: -1301.501286 hartree
dipole: 0.4487 0.2174 -2.7538
dipole: 2.7985
quadrupole: -160.6804 -145.8185 -174.1583
quadrupole: 5.7146 9.6201 8.3381
quadrupole: -0.4613 14.4006 -13.9393 5.7146 9.6201 8.3381
hfenergy: -1301.9073356 hartree
pointgroup: C01 [X(C23H28N2O4)]
dipole: 0.1437593 -0.1092158 1.086121 debye
polarizability: 297.1953543|-39.3171028|287.3850831|-15.2612468|29.9004797|264.7009218 unknown
InChI: InChI=1S/C23H28N2O4/c1-4-15-14-25-11-9-16(15)12-21(25)22(29-23(26)28-5-2)18-8-10-24-20-7-6-17(27-3)13-19(18)20/h4,6-8,10,13,15-16,21-22H,1,5,9,11-12,14H2,2-3H3
charge 0 multiplicity 1
57 atoms
O  -0.07966 -2.266474 -0.129328
O  -1.190741 -4.154362 0.276987
O  -1.843184 -2.214262 1.43007
O  -2.745531 3.043455 2.247949
N  1.951369 0.895279 -0.20787
N  -2.335841 1.231311 -3.066797
C  3.694699 -0.441036 1.180813
C  1.60088 -0.561267 -0.224768
C  2.499769 -1.353851 0.786597
C  4.367723 0.092303 -0.13246
C  3.141828 0.74046 2.024357
C  3.304106 1.04814 -0.820846
C  2.003094 1.430252 1.191099
C  0.08775 -0.775489 0.011131
C  5.683171 0.794693 0.100903
C  -0.796853 -0.074564 -1.008394
C  6.872172 0.436828 -0.447273
C  -1.65334 1.036897 -0.664139
C  -0.769077 -0.500783 -2.340399
C  -1.116605 -2.815675 0.606408
C  -2.39604 1.663831 -1.747991
C  -1.822157 1.544213 0.658043
C  -1.549476 0.170746 -3.330179
C  -3.241956 2.778791 -1.459632
C  -2.663193 2.636412 0.906679
C  -3.379182 3.269737 -0.161474
C  -2.260508 -4.918823 0.996943
C  -2.178583 -6.353351 0.489854
C  -3.633477 4.161755 2.574976
H  4.434101 -1.01689 1.765695
H  1.810391 -0.910531 -1.254513
H  2.849857 -2.298578 0.334468
H  1.926269 -1.623528 1.695554
H  4.553663 -0.780744 -0.790561
H  3.946908 1.456383 2.272513
H  2.74873 0.35537 2.983921
H  3.236291 0.83482 -1.902367
H  3.605292 2.105955 -0.709492
H  1.016249 1.285889 1.662725
H  2.161414 2.520896 1.118798
H  -0.195715 -0.512212 1.043729
H  5.649017 1.679762 0.757085
H  6.959155 -0.432282 -1.112118
H  7.791464 0.999785 -0.250001
H  -0.156062 -1.360028 -2.630743
H  -1.327311 1.085217 1.517473
H  -1.523015 -0.166717 -4.373142
H  -3.77972 3.227599 -2.300232
H  -4.03413 4.124495 0.030882
H  -3.233067 -4.443556 0.776087
H  -2.072575 -4.840161 2.08301
H  -1.189806 -6.792165 0.705961
H  -2.348664 -6.396414 -0.599202
H  -2.950028 -6.968352 0.988054
H  -4.684771 3.934664 2.311944
H  -3.544427 4.285667 3.664221
H  -3.315368 5.093694 2.068393
