program: Orca
programVersion: 5.0.3
elementType: Cl N N N N N N C C C C C C C C C H H H H H H H H H H H H H
charge: 0
multiplicity: 1
keywords: wb97x-d3
keywords: def2-TZVPP
keywords: def2/J RIJCOSX
keywords: DEFGRID2
keywords: scfconv7
keywords: smallprint printgap noloewdin
keywords: NOSOSCF
formula: C9H13ClN6
InChI: InChI=1/C9H13ClN6/c1-4-12-7-13-6(10)14-8(15-7)16-9(2,3)5-11/h12,16H,4H2,1-3H3
29 atoms
Cl -2.839742 1.445899 -0.880529
N  1.761954 0.409017 0.35916
N  -1.264775 -3.01677 0.198566
N  0.288805 -1.324891 0.327353
N  -0.412109 0.869746 -0.219757
N  -1.960181 -0.903866 -0.288758
N  1.737841 2.663475 -2.225371
C  2.237486 1.769393 0.19209
C  3.763232 1.739373 0.317793
C  1.648261 2.738862 1.21854
C  0.510756 -0.028044 0.153335
C  1.920783 2.251716 -1.167586
C  -0.954425 -1.728745 0.085905
C  -0.365683 -4.078679 0.595116
C  -0.625084 -4.569785 2.008735
C  -1.596268 0.339003 -0.408363
H  2.449317 -0.29632 0.58174
H  4.037702 1.392135 1.314572
H  4.212423 1.076015 -0.421311
H  4.174711 2.737498 0.180912
H  1.906689 2.393946 2.21994
H  0.566039 2.808237 1.139049
H  2.069399 3.73472 1.080013
H  -0.4831 -4.901091 -0.112872
H  0.656179 -3.719246 0.497166
H  -2.229438 -3.256222 0.025132
H  0.049524 -5.393011 2.248097
H  -0.463818 -3.778906 2.742271
H  -1.646944 -4.935899 2.12172
elementType: Cl N C H
totalener: -1139.62768218 hartree
nucrepener: 1200.94606460 hartree
electener: -2340.57374678 hartree
oneelecener: -3941.86279327 hartree
twoeener: 1601.28904649 hartree
cpcmener: -0.03078359 hartree
kineticenergy: 1136.04607949 hartree
xcener: -86.707721222959 hartree
chargesum: -0.0000000
charge: -0.059211 -0.206545 -0.181857 -0.452921 -0.414743 -0.387279 -0.098330 0.410605 -0.279257 -0.305098 0.437197 -0.280263 0.406514 0.002413 -0.249336 0.191886 0.168807 0.116639 0.122915 0.108343 0.108922 0.119331 0.110544 0.095026 0.089348 0.171593 0.087613 0.083062 0.084082
qa: -0.0592 -0.2065 -0.1819 -0.4529 -0.4147 -0.3873 -0.0983 0.4106 -0.2793 -0.3051 0.4372 -0.2803 0.4065 0.0024 -0.2493 0.1919 0.1688 0.1166 0.1229 0.1083 0.1089 0.1193 0.1105 0.0950 0.0893 0.1716 0.0876 0.0831 0.0841
va: 1.2463 3.2157 3.2264 2.9967 2.9011 2.9767 3.1235 3.8701 3.8981 3.8960 4.1542 4.0424 4.2107 3.8477 3.9386 4.4468 1.0249 1.0010 1.0044 1.0070 1.0043 1.0163 1.0058 0.9968 1.0244 1.0187 1.0081 1.0046 1.0040
dispcorr: -0.011810100 hartree
energy: -1139.639492278818
dipole: 18.37297 -16.60192 1.77105 -13.42384 11.18883 -2.23501 14.28138 -11.88957 2.39181
magnitude: 3.72191 au
magnitude: 9.46035 debye
