program: Orca
programVersion: 4.2.1
elementType: Cl O N N C C C C C C C C C C H H H H H H H H H H H H H
charge: 0
multiplicity: 1
keywords: wb97x-d3
keywords: def2-TZVPP
keywords: def2/J RIJCOSX GRIDX6 NOFINALGRIDX
keywords: grid4 nofinalgrid
keywords: scfconv7
keywords: smallprint printgap noloewdin
keywords: NOSOSCF
formula: C10H13ClN2O
InChI: InChI=1/C10H13ClN2O/c1-7-4-5-8(6-9(7)11)12-10(14)13(2)3/h4-6,12H,1-3H3
27 atoms
Cl 3.462343 1.588854 -0.002605
O  -2.652237 -1.571325 -0.000966
N  -1.413386 0.342339 0.006524
N  -3.707263 0.440908 0.001179
C  -0.118807 -0.170837 0.00426
C  2.606847 -0.976905 -0.000225
C  0.91281 0.771908 0.002534
C  0.223875 -1.523042 0.003814
C  2.232291 0.364199 0.000226
C  1.560743 -1.892537 0.001624
C  -2.602613 -0.343414 0.001937
C  4.037136 -1.416352 -0.002699
C  -5.026255 -0.156216 -0.005755
C  -3.649295 1.890078 0.00097
H  0.678803 1.829377 0.002979
H  -0.529112 -2.291494 0.005197
H  -1.452639 1.349089 0.007029
H  1.798719 -2.949169 0.001013
H  4.575271 -1.050236 0.873003
H  4.10328 -2.502946 -0.001649
H  4.571629 -1.052239 -0.881469
H  -4.959769 -1.238414 -0.010369
H  -5.584834 0.15386 -0.890087
H  -5.590919 0.145831 0.877521
H  -3.157073 2.287191 -0.889389
H  -3.152949 2.28684 0.889043
H  -4.663089 2.279775 0.003814
elementType: Cl O N C H
totalener: -1033.92281102 hartree
nucrepener: 959.68297601 hartree
electener: -1993.60578703 hartree
oneelecener: -3319.23829826 hartree
twoeener: 1325.63251123 hartree
cpcmener: -0.02964536 hartree
kineticenergy: 1030.70510040 hartree
xcener: -77.183514456871 hartree
chargesum: -0.0000000
charge: -0.098475 -0.594517 -0.180676 -0.152870 0.168569 -0.070032 -0.193198 -0.244896 0.062861 -0.117449 0.443739 -0.219762 -0.187030 -0.195605 0.119424 0.164083 0.173538 0.142465 0.103345 0.091720 0.103293 0.104659 0.114356 0.114261 0.119696 0.119068 0.109434
qa: -0.0985 -0.5945 -0.1807 -0.1529 0.1686 -0.0700 -0.1932 -0.2449 0.0629 -0.1174 0.4437 -0.2198 -0.1870 -0.1956 0.1194 0.1641 0.1735 0.1425 0.1033 0.0917 0.1033 0.1047 0.1144 0.1143 0.1197 0.1191 0.1094
va: 1.2314 1.9071 3.2344 3.1389 3.9061 3.7214 4.0097 3.9666 3.9215 3.9128 4.2330 3.9085 3.8819 3.8884 1.0303 1.0328 1.0110 1.0004 0.9965 1.0059 0.9965 1.0258 0.9848 0.9849 0.9887 0.9887 0.9989
dispcorr: -0.009871952 hartree
energy: -1033.932682975193
dipole: -17.11025 16.01813 -1.09212 -2.85377 4.77756 1.92378 -0.01244 0.01248 0.00004
magnitude: 2.21216 au
magnitude: 5.62287 debye
