program: Orca
programVersion: 4.2.1
elementType: Cl O N N C C C C C C C C C C H H H H H H H H H H H H H
charge: 0
multiplicity: 1
keywords: wb97x-d3
keywords: def2-TZVPP
keywords: def2/J RIJCOSX GRIDX6 NOFINALGRIDX
keywords: grid4 nofinalgrid
keywords: scfconv7
keywords: smallprint printgap noloewdin
keywords: NOSOSCF
formula: C10H13ClN2O
InChI: InChI=1/C10H13ClN2O/c1-7-4-5-8(6-9(7)11)12-10(14)13(2)3/h4-6,12H,1-3H3
27 atoms
Cl 3.505971 1.373432 -0.420649
O  -3.546201 -0.110211 -1.635552
N  -1.438882 0.472516 -1.053138
N  -3.014175 -0.116766 0.571131
C  -0.242041 0.026609 -0.476904
C  2.246032 -0.790121 0.596086
C  0.901567 0.798453 -0.663168
C  -0.13627 -1.15738 0.246891
C  2.114434 0.380447 -0.145661
C  1.08601 -1.536094 0.774672
C  -2.731916 0.058272 -0.752943
C  3.557635 -1.231606 1.167176
C  -4.29106 -0.698509 0.914689
C  -2.357291 0.602219 1.639817
H  0.842869 1.730948 -1.209427
H  -0.999962 -1.790956 0.392086
H  -1.3654 0.773757 -2.012384
H  1.146292 -2.460565 1.335791
H  3.964723 -0.492849 1.858712
H  3.446154 -2.169295 1.709138
H  4.3051 -1.383699 0.387555
H  -4.198032 -1.226558 1.863977
H  -4.606761 -1.407567 0.155726
H  -5.074255 0.057664 1.019108
H  -1.836868 -0.069569 2.326402
H  -3.100082 1.163631 2.212386
H  -1.635741 1.317677 1.257347
totalener: -1033.90585699 hartree
nucrepener: 981.23508747 hartree
electener: -2015.14094446 hartree
oneelecener: -3361.51991770 hartree
twoeener: 1346.37897324 hartree
kineticenergy: 1030.73566566 hartree
xcener: -77.176428732230 hartree
chargesum: 0.0000000
charge: -0.078461 -0.405929 -0.206293 -0.188540 0.167208 -0.030265 -0.212944 -0.216842 0.064932 -0.081119 0.341983 -0.219025 -0.172847 -0.188230 0.112390 0.132733 0.144313 0.112956 0.103137 0.076982 0.104302 0.096651 0.111109 0.101387 0.104722 0.110617 0.115074
qa: -0.0785 -0.4059 -0.2063 -0.1885 0.1672 -0.0303 -0.2129 -0.2168 0.0649 -0.0811 0.3420 -0.2190 -0.1728 -0.1882 0.1124 0.1327 0.1443 0.1130 0.1031 0.0770 0.1043 0.0967 0.1111 0.1014 0.1047 0.1106 0.1151
va: 1.2520 2.1113 3.0928 3.0283 3.7549 3.7509 4.1240 4.0090 3.9873 3.9129 4.3414 3.9259 3.9200 3.9101 1.0313 1.0166 1.0373 1.0062 0.9978 1.0076 0.9976 0.9881 1.0139 0.9926 0.9877 0.9956 1.0030
dispcorr: -0.011457293 hartree
energy: -1033.917314288056
dipole: -13.21723 13.53703 0.31980 -7.60076 7.37544 -0.22532 10.97214 -9.74873 1.22341
magnitude: 1.28443 au
magnitude: 3.26477 debye
