program: Orca
programVersion: 4.2.1
elementType: Cl Cl O N C C C C C C C C C C H H H H H H H H H
charge: 0
multiplicity: 1
keywords: wb97x-d3
keywords: def2-TZVPP
keywords: def2/J RIJCOSX GRIDX6 NOFINALGRIDX
keywords: grid4 nofinalgrid
keywords: scfconv7
keywords: smallprint printgap noloewdin
keywords: NOSOSCF
formula: C10H9Cl2NO
InChI: InChI=1/C10H9Cl2NO/c1-6(2)10(14)13-7-3-4-8(11)9(12)5-7/h3-5,13H,1H2,2H3
23 atoms
Cl 2.596157 -1.893687 0.009678
Cl 3.944986 0.938545 0.253489
O  -2.326615 -1.437915 0.937851
N  -1.930935 0.504783 -0.154423
C  -0.538042 0.552559 -0.047388
C  0.257688 -0.588738 -0.061067
C  0.065954 1.805396 0.037052
C  -2.750486 -0.445876 0.36524
C  1.634938 -0.464466 0.031248
C  1.439548 1.918925 0.121697
C  2.235557 0.783941 0.128693
C  -4.210591 -0.176205 0.19323
C  -4.669032 0.923481 -0.717027
C  -5.062566 -0.934683 0.880027
H  -2.357748 1.347677 -0.507125
H  -0.172911 -1.571821 -0.164445
H  -0.541154 2.701313 0.044249
H  1.893825 2.897198 0.193187
H  -4.402038 1.911558 -0.335479
H  -4.244552 0.832035 -1.717651
H  -5.752247 0.904764 -0.818259
H  -6.131105 -0.785874 0.798568
H  -4.731556 -1.722366 1.542765
elementType: Cl O N C H
totalener: -1436.93231062 hartree
nucrepener: 1021.77553879 hartree
electener: -2458.70784941 hartree
oneelecener: -4001.68651053 hartree
twoeener: 1542.97866112 hartree
cpcmener: -0.02852104 hartree
kineticenergy: 1433.37974888 hartree
xcener: -92.478658458149 hartree
chargesum: -0.0000000
charge: -0.070737 -0.074475 -0.530610 -0.160518 0.204243 -0.192640 -0.230123 0.450641 0.086611 -0.094970 0.006049 -0.144722 -0.245537 -0.183163 0.191005 0.129516 0.145392 0.147419 0.105255 0.116557 0.098876 0.124922 0.121010
qa: -0.0707 -0.0745 -0.5306 -0.1605 0.2042 -0.1926 -0.2301 0.4506 0.0866 -0.0950 0.0060 -0.1447 -0.2455 -0.1832 0.1910 0.1295 0.1454 0.1474 0.1053 0.1166 0.0989 0.1249 0.1210
va: 1.2470 1.2434 1.9716 3.2568 3.7714 4.0884 4.0395 4.0563 3.9596 3.9720 3.9394 3.6814 3.9206 3.9274 0.9967 1.0444 1.0051 1.0030 0.9945 0.9971 1.0033 1.0074 1.0228
dispcorr: -0.008721495 hartree
energy: -1436.941032114851
dipole: -33.67197 31.61737 -2.05460 7.44311 -4.94171 2.50140 -2.05837 1.03176 -1.02660
magnitude: 3.39592 au
magnitude: 8.63174 debye
