program: Orca
programVersion: 4.2.1
elementType: Cl Cl O N C C C C C C C C C C H H H H H H H H H
charge: 0
multiplicity: 1
keywords: wb97x-d3
keywords: def2-TZVPP
keywords: def2/J RIJCOSX GRIDX6 NOFINALGRIDX
keywords: grid4 nofinalgrid
keywords: scfconv7
keywords: smallprint printgap noloewdin
keywords: NOSOSCF
formula: C10H9Cl2NO
InChI: InChI=1/C10H9Cl2NO/c1-6(2)10(14)13-7-3-4-8(11)9(12)5-7/h3-5,13H,1H2,2H3
23 atoms
Cl 2.572206 -1.875773 0.168047
Cl 3.992573 0.92208 -0.071808
O  -2.428816 -1.576273 -0.037383
N  -1.907144 0.637431 -0.034344
C  -0.514078 0.622082 -0.037412
C  0.259462 -0.53159 0.059133
C  0.125458 1.859811 -0.138868
C  -2.774897 -0.406181 -0.009559
C  1.643422 -0.42924 0.048816
C  1.501056 1.947631 -0.147713
C  2.27641 0.800794 -0.055284
C  -4.219288 -0.029067 0.039267
C  -5.145161 -0.941478 -0.700356
C  -4.636235 1.009683 0.760575
H  -2.317902 1.556895 -0.097031
H  -0.189016 -1.507199 0.141637
H  -0.458665 2.768246 -0.211574
H  1.974173 2.915977 -0.228249
H  -5.041401 -1.972063 -0.360173
H  -6.181259 -0.638611 -0.560356
H  -4.929795 -0.934534 -1.770967
H  -5.689199 1.248468 0.831295
H  -3.968065 1.643827 1.328665
elementType: Cl O N C H
totalener: -1436.93189664 hartree
nucrepener: 1019.32891118 hartree
electener: -2456.26080781 hartree
oneelecener: -3996.67938005 hartree
twoeener: 1540.41857224 hartree
cpcmener: -0.02473438 hartree
kineticenergy: 1433.37978252 hartree
xcener: -92.478092246249 hartree
chargesum: -0.0000000
charge: -0.070637 -0.075768 -0.514434 -0.126970 0.189286 -0.200018 -0.231004 0.460268 0.078469 -0.089287 -0.007950 -0.131495 -0.212425 -0.211788 0.172202 0.144146 0.138887 0.147012 0.099708 0.093846 0.105697 0.119912 0.122342
qa: -0.0706 -0.0758 -0.5144 -0.1270 0.1893 -0.2000 -0.2310 0.4603 0.0785 -0.0893 -0.0079 -0.1315 -0.2124 -0.2118 0.1722 0.1441 0.1389 0.1470 0.0997 0.0938 0.1057 0.1199 0.1223
va: 1.2492 1.2428 1.9882 3.2994 3.8991 4.0193 3.9968 4.0162 3.9708 3.9766 3.9387 3.7518 3.9287 3.9217 1.0099 1.0574 1.0063 1.0029 1.0087 1.0052 0.9973 1.0095 1.0133
dispcorr: -0.008673284 hartree
energy: -1436.940569921366
dipole: -34.05769 32.12123 -1.93646 5.97960 -3.35574 2.62386 -0.97978 0.89978 -0.08000
magnitude: 3.26205 au
magnitude: 8.29146 debye
