program: Orca
programVersion: 4.2.1
elementType: Cl Cl O N C C C C C C C C C C H H H H H H H H H
charge: 0
multiplicity: 1
keywords: wb97x-d3
keywords: def2-TZVPP
keywords: def2/J RIJCOSX GRIDX6 NOFINALGRIDX
keywords: grid4 nofinalgrid
keywords: scfconv7
keywords: smallprint printgap noloewdin
keywords: NOSOSCF
formula: C10H9Cl2NO
InChI: InChI=1/C10H9Cl2NO/c1-6(2)10(14)13-7-3-4-8(11)9(12)5-7/h3-5,13H,1H2,2H3
23 atoms
Cl 2.567139 -1.875271 0.179995
Cl 3.994059 0.922953 -0.055398
O  -2.430351 -1.574153 -0.071169
N  -1.90683 0.639956 -0.040845
C  -0.514551 0.62742 -0.043444
C  0.258719 -0.527121 0.057432
C  0.126978 1.864226 -0.146071
C  -2.774239 -0.406778 -0.025431
C  1.642303 -0.427668 0.05341
C  1.503294 1.948814 -0.148645
C  2.277012 0.801871 -0.049471
C  -4.219657 -0.030365 0.037668
C  -5.149362 -0.94131 -0.698778
C  -4.630409 1.001619 0.772593
H  -2.32145 1.557109 -0.107427
H  -0.19423 -1.501175 0.138427
H  -0.454345 2.774677 -0.223924
H  1.979696 2.916242 -0.229147
H  -5.070475 -1.965929 -0.333175
H  -6.183073 -0.619096 -0.583553
H  -4.917783 -0.965716 -1.765547
H  -5.682416 1.24391 0.853676
H  -3.956193 1.6267 1.345182
elementType: Cl O N C H
totalener: -1436.93943224 hartree
nucrepener: 1019.23202523 hartree
electener: -2456.17145747 hartree
oneelecener: -3996.44329613 hartree
twoeener: 1540.27183865 hartree
cpcmener: -0.02038436 hartree
kineticenergy: 1433.37291682 hartree
xcener: -92.475749744169 hartree
chargesum: 0.0000000
charge: -0.067512 -0.074154 -0.487334 -0.133047 0.191951 -0.197418 -0.232926 0.445204 0.078306 -0.089267 -0.009058 -0.126474 -0.210042 -0.214727 0.167596 0.143826 0.135355 0.144147 0.101722 0.092278 0.103952 0.117770 0.119851
qa: -0.0675 -0.0742 -0.4873 -0.1330 0.1920 -0.1974 -0.2329 0.4452 0.0783 -0.0893 -0.0091 -0.1265 -0.2100 -0.2147 0.1676 0.1438 0.1354 0.1441 0.1017 0.0923 0.1040 0.1178 0.1199
va: 1.2522 1.2442 2.0191 3.2912 3.8962 4.0197 4.0012 4.0361 3.9761 3.9826 3.9456 3.7453 3.9322 3.9217 1.0135 1.0579 1.0072 1.0041 1.0074 1.0054 0.9988 1.0104 1.0142
dispcorr: -0.008678479 hartree
energy: -1436.948110719454
dipole: -34.04962 32.15529 -1.89433 5.95930 -3.51325 2.44606 -1.00554 0.94395 -0.06158
magnitude: 3.09442 au
magnitude: 7.86540 debye
