program: Orca
programVersion: 4.2.1
elementType: Cl Cl O N C C C C C C C C C C H H H H H H H H H
charge: 0
multiplicity: 1
keywords: wb97x-d3
keywords: def2-TZVPP
keywords: def2/J RIJCOSX GRIDX6 NOFINALGRIDX
keywords: grid4 nofinalgrid
keywords: scfconv7
keywords: smallprint printgap noloewdin
keywords: NOSOSCF
formula: C10H9Cl2NO
InChI: InChI=1/C10H9Cl2NO/c1-6(2)10(14)13-7-3-4-8(11)9(12)5-7/h3-5,13H,1H2,2H3
23 atoms
Cl 2.912008 -1.886424 0.439654
Cl 3.880887 1.063338 -0.124624
O  -2.956128 1.620341 -0.380525
N  -1.862764 -0.325583 0.020686
C  -0.529261 0.075686 -0.027919
C  0.424475 -0.919292 0.191669
C  -0.096623 1.37949 -0.276532
C  -2.984818 0.424113 -0.147983
C  1.77439 -0.62408 0.163592
C  1.25847 1.660577 -0.301449
C  2.204757 0.673769 -0.084366
C  -4.270118 -0.336375 -0.027621
C  -4.258831 -1.806617 0.266006
C  -5.401862 0.345835 -0.191834
H  -1.993975 -1.308413 0.206435
H  0.112762 -1.937875 0.3871
H  -0.793031 2.181001 -0.451423
H  1.578943 2.675099 -0.495861
H  -3.779461 -2.034408 1.221277
H  -5.275659 -2.191665 0.319925
H  -3.741107 -2.378299 -0.508122
H  -6.364821 -0.142397 -0.117069
H  -5.410945 1.406352 -0.403399
elementType: Cl O N C H
totalener: -1436.93955797 hartree
nucrepener: 1015.69891902 hartree
electener: -2452.63847699 hartree
oneelecener: -3989.14039269 hartree
twoeener: 1536.50191570 hartree
cpcmener: -0.02093807 hartree
kineticenergy: 1433.36689328 hartree
xcener: -92.477096816170 hartree
chargesum: 0.0000000
charge: -0.066852 -0.073892 -0.500221 -0.144915 0.208153 -0.199827 -0.247973 0.440704 0.093058 -0.100970 -0.007233 -0.142528 -0.255676 -0.177860 0.183081 0.120575 0.163396 0.142361 0.111060 0.100572 0.110207 0.121309 0.123470
qa: -0.0669 -0.0739 -0.5002 -0.1449 0.2082 -0.1998 -0.2480 0.4407 0.0931 -0.1010 -0.0072 -0.1425 -0.2557 -0.1779 0.1831 0.1206 0.1634 0.1424 0.1111 0.1006 0.1102 0.1213 0.1235
va: 1.2514 1.2441 2.0107 3.2927 3.8702 4.0443 4.0117 4.0558 3.9665 3.9909 3.9464 3.6883 3.9225 3.9229 1.0008 1.0298 1.0343 1.0059 0.9945 1.0044 0.9943 1.0083 1.0238
dispcorr: -0.008579529 hartree
energy: -1436.948137499488
dipole: -33.22390 31.74547 -1.47843 -2.34564 0.66860 -1.67704 -0.28656 0.57672 0.29017
magnitude: 2.25442 au
magnitude: 5.73028 debye
