program: Orca
programVersion: 4.2.1
elementType: Br O O N N C C C C C C C C C H H H H H H H H H H H H H
charge: 0
multiplicity: 1
keywords: wb97x-d3
keywords: def2-TZVPP
keywords: def2/J RIJCOSX GRIDX6 NOFINALGRIDX
keywords: grid4 nofinalgrid
keywords: scfconv7
keywords: smallprint printgap noloewdin
keywords: NOSOSCF
formula: C9H13BrN2O2
InChI: InChI=1/C9H13BrN2O2/c1-4-5(2)12-8(13)7(10)6(3)11-9(12)14/h5,11H,4H2,1-3H3
27 atoms
Br 2.668989 0.628202 0.155887
O  -0.130292 1.697046 -0.236241
O  -2.446476 -2.235886 -0.179414
N  -1.338145 -0.229611 -0.208794
N  -0.216134 -2.246363 0.066683
C  -2.613368 0.50329 -0.402098
C  -2.9304 1.428043 0.775165
C  -2.674662 1.175568 -1.76633
C  -0.143683 0.487753 -0.140873
C  -1.410855 -1.602762 -0.112948
C  -4.399088 1.828363 0.803386
C  1.002951 -1.65074 0.152713
C  1.054454 -0.305627 0.051791
C  2.173966 -2.546994 0.352852
H  -3.372085 -0.276199 -0.39893
H  -2.310122 2.323275 0.746528
H  -2.691146 0.904671 1.704819
H  -2.009132 2.03178 -1.850224
H  -2.430879 0.467963 -2.559922
H  -3.690703 1.522468 -1.954608
H  -4.609452 2.438123 1.682645
H  -4.685822 2.417039 -0.069027
H  -5.053894 0.955654 0.845964
H  -0.274559 -3.252765 0.139141
H  2.685966 -2.311147 1.285625
H  2.894566 -2.430734 -0.456224
H  1.875743 -3.593111 0.388987
elementType: Br O N C H
totalener: -3185.08762595 hartree
nucrepener: 1279.88350749 hartree
electener: -4464.97113343 hartree
oneelecener: -6957.67944445 hartree
twoeener: 2492.70831101 hartree
cpcmener: -0.02608622 hartree
kineticenergy: 3178.80369990 hartree
xcener: -128.502433691046 hartree
chargesum: 0.0000000
charge: -0.012537 -0.451429 -0.490350 -0.089653 -0.113795 0.090247 -0.103727 -0.292427 0.323591 0.378583 -0.280254 0.180296 -0.233502 -0.198420 0.082740 0.077062 0.076137 0.099993 0.099107 0.099813 0.094714 0.081080 0.082973 0.182322 0.114186 0.113626 0.089624
qa: -0.0125 -0.4514 -0.4903 -0.0897 -0.1138 0.0902 -0.1037 -0.2924 0.3236 0.3786 -0.2803 0.1803 -0.2335 -0.1984 0.0827 0.0771 0.0761 0.1000 0.0991 0.0998 0.0947 0.0811 0.0830 0.1823 0.1142 0.1136 0.0896
va: 1.2615 2.0677 2.0297 3.1996 3.3139 3.7458 3.8553 3.9231 4.2168 4.3408 3.9446 3.7819 3.9210 3.9367 1.0419 1.0252 1.0107 1.0154 1.0064 1.0010 1.0026 1.0006 1.0003 1.0137 0.9987 0.9990 1.0130
dispcorr: -0.011991702 hartree
energy: -3185.099617650580
dipole: -47.11541 47.90382 0.78841 -4.73024 2.69032 -2.03992 -1.91755 2.20811 0.29056
magnitude: 2.20620 au
magnitude: 5.60771 debye
